{"text_format":"3","workbook":"xlsx","n_sheets":3,"sheets":["Gear List","Packing list","Final Check"],"not_rendered":{"images":3,"macros":1,"defined_names":2},"read":"whole","date_system":"1900"}

{"sheet":"Gear List","index":0,"n_rows":336,"n_cols":14,"rows_kept":336,"merged":[[0,0,0,6],[2,0,2,1],[15,0,15,1],[23,0,23,1],[25,0,25,1],[38,0,38,1],[43,0,43,1],[49,0,49,1],[54,0,54,1],[77,0,77,1],[81,0,81,1],[88,0,88,1],[89,0,89,1],[103,0,103,1],[110,0,110,1],[125,0,125,1],[133,0,133,1],[139,0,139,1],[143,0,143,1],[146,0,146,1],[154,0,154,1],[202,0,202,1],[250,6,250,7],[259,6,259,7],[265,0,265,1],[276,0,276,1],[295,0,295,1],[301,1,301,12]]}
["Gear List",{"$nulls":8},"Pack Weight in LBS:","Extra Gear weight in LBS:"]
["Number of:","Item","Item Weight in oz.","Item Description","In main Pack","On Person or second pack","Total packed weight of item in Oz.","Total weight of item in Lbs.","Packed Weight in Oz:",{"$f":"I306","v":{"v":72.79525,"d":"72.80"}},{"$f":"SUM(K3:K283)","v":{"v":14.093749999999998,"d":"14.09"}},null,"Where to pack it"]
["Pack"]
[0,"Backpack",{"v":86.4,"d":"86"},"60 liter Osprey pack (with Rain cover)",1,null,{"$f":"IF(E4=1,A4*C4,0)","v":{"v":0,"d":"0.00"}},{"$f":"G4/16","v":{"v":0,"d":"0.00"}},{"$f":"G4","v":{"v":0,"d":"0.00"}},null,{"$f":"IF(F4>=1,(A4*C4)/16,0)","v":{"v":0,"d":"0.00"}},null,"BP",{"$f":"_xlfn.XLOOKUP($M4,$A$319:$A$336,$B$319:$B$336,\"Not Found\")","v":"BackPack"}]
[0,"Dry Pack",{"v":43.9,"d":"44"},"32 L  Earth Pack",null,3,{"$f":"IF(E5=1,A5*C5,0)","v":{"v":0,"d":"0.00"}},{"$f":"G5/16","v":{"v":0,"d":"0.00"}},{"$f":"G5","v":{"v":0,"d":"0.00"}},null,{"$f":"IF(F5>=1,(A5*C5)/16,0)","v":{"v":0,"d":"0.00"}},null,"FP","Food Pack / Barrel"]
[1,"Dry Pack",{"v":45.4,"d":"45"},"55 L  Earth Pack",1," ",{"$f":"IF(E6=1,A6*C6,0)","v":{"v":45.4,"d":"45.40"}},{"$f":"G6/16","v":{"v":2.8375,"d":"2.84"}},{"$f":"G6","v":{"v":45.4,"d":"45.40"}},null,{"$f":"IF(F6>=1,(A6*C6)/16,0)","v":{"v":2.8375,"d":"2.84"}},null,"BP","BackPack"]
[0,"Large Yellow Dry Pack",48,"Large Yellow Dry Pack"," ",3,{"$f":"IF(E7=1,A7*C7,0)","v":{"v":0,"d":"0.00"}},{"$f":"G7/16","v":{"v":0,"d":"0.00"}},{"$f":"G7","v":{"v":0,"d":"0.00"}},null,{"$f":"IF(F7>=1,(A7*C7)/16,0)","v":{"v":0,"d":"0.00"}},null,"FP","Food Pack / Barrel"]
[1,"Dry Compression sac",{"v":1.8,"d":"2"},"2X Small Sea to Summit Dry Compression Sac",1,null,{"$f":"IF(E8=1,A8*C8,0)","v":{"v":1.8,"d":"1.80"}},{"$f":"G8/16","v":{"v":0.1125,"d":"0.11"}},{"$f":"G8","v":{"v":1.8,"d":"1.80"}},null,{"$f":"IF(F8>=1,(A8*C8)/16,0)","v":{"v":0,"d":"0.00"}},null,"XC","XXS Compression Sack"]
[1,"Dry Compression sac",{"v":2.6,"d":"3"},"Small Sea to Summit Dry Compression Sac",1,null,{"v":2.6,"d":"2.60"},{"v":0.1625,"d":"0.16"},{"v":2.6,"d":"2.60"},null,{"v":0,"d":"0.00"},null,"SC","Small Compression Sack"]
[1,"Dry Compression sac",{"v":5.2,"d":"5"},"Med Sea to Summit Dry Compression Sac",1,null,{"v":5.2,"d":"5.20"},{"v":0.325,"d":"0.33"},{"v":5.2,"d":"5.20"},null,{"v":0,"d":"0.00"},null,"MC","Medium Compression sack"]
[1,"Stoic Dry Bag",{"v":3.4,"d":"3"},"Blue Dry Bag",1,null,{"v":3.4,"d":"3.40"},{"v":0.2125,"d":"0.21"},{"v":3.4,"d":"3.40"},null,{"v":0,"d":"0.00"},null,"BS","Blue Stuff Sack"]
[1,"Stoic Dry Bag",{"v":6.5,"d":"7"},"Orange Dry Bag",1,null,{"v":6.5,"d":"6.50"},{"v":0.40625,"d":"0.41"},{"v":6.5,"d":"6.50"},null,{"v":0,"d":"0.00"},null,"OS","Orange Stuff Sack"]
[0,"Walking stick",12,"SwissGear walking stick (Dad's)",null,1,{"v":0,"d":"0.00"},{"v":0,"d":"0.00"},{"v":0,"d":"0.00"},null,{"v":0,"d":"0.00"},null,"BP","BackPack"]
[0,"Walking sticks",{"v":14.9,"d":"15"},"The FitLife walking sticks (Carbon - Pair - No baskets)",null,1,{"v":0,"d":"0.00"},{"v":0,"d":"0.00"},{"v":0,"d":"0.00"},null,{"v":0,"d":"0.00"},null,"BP","BackPack"]
[1,"Yellow Dry Bag",21,"Heavy Yellow Dry Bag",null,3,{"v":0,"d":"0.00"},{"v":0,"d":"0.00"},{"v":0,"d":"0.00"},null,{"v":1.3125,"d":"1.31"},null,"FP","Food Pack / Barrel"]
["Sleeping bag"]
[0,"Compression sac for cats meow bag",{"v":1.8,"d":"2"},"NorthFace Cat's Meow compression sac",1,null,{"$f":"IF(E17=1,A17*C17,0)","v":{"v":0,"d":"0.00"}},{"$f":"G17/16","v":{"v":0,"d":"0.00"}},{"$f":"G17","v":{"v":0,"d":"0.00"}},null,{"$f":"IF(F17>=1,(A17*C17)/16,0)","v":{"v":0,"d":"0.00"}},null,"PJ",{"$f":"_xlfn.XLOOKUP($M17,$A$319:$A$336,$B$319:$B$336,\"Not Found\")","v":"Sleeping Bag Stuff Sack"}]
[0,"Mummy Bag",54,"Wool Mummy bag - 3.5 lbs",1,null,{"$f":"IF(E18=1,A18*C18,0)","v":{"v":0,"d":"0.00"}},{"$f":"G18/16","v":{"v":0,"d":"0.00"}},{"$f":"G18","v":{"v":0,"d":"0.00"}},null,{"$f":"IF(F18>=1,(A18*C18)/16,0)","v":{"v":0,"d":"0.00"}},null,"PJ","Sleeping Bag Stuff Sack"]
[0,"Mummy Bag",{"v":62.8,"d":"63"},"Down Mummy bag - Could be used for Under Quilt",1,null,{"v":0,"d":"0.00"},{"v":0,"d":"0.00"},{"v":0,"d":"0.00"},null,{"v":0,"d":"0.00"},null,"PJ","Sleeping Bag Stuff Sack"]
[1,"Bed Sheet",16,"Bed Sheet",1,null,{"$f":"IF(E20=1,A20*C20,0)","v":{"v":16,"d":"16.00"}},{"$f":"G20/16","v":{"v":1,"d":"1.00"}},{"$f":"G20","v":{"v":16,"d":"16.00"}},null,{"$f":"IF(F20>=1,(A20*C20)/16,0)","v":{"v":0,"d":"0.00"}},null,"PJ","Sleeping Bag Stuff Sack"]
[1,"Sleeping bag",34,"NorthFace Cat's Meow Sleeping Bag",1,null,{"v":34,"d":"34.00"},{"v":2.125,"d":"2.13"},{"v":34,"d":"34.00"},null,{"v":0,"d":"0.00"},null,"PJ","Sleeping Bag Stuff Sack"]
[0,"Sleeping bag",{"v":107.4,"d":"107"},"Heavy Sleeping bag  6.71 lbs",1,null,{"v":0,"d":"0.00"},{"v":0,"d":"0.00"},{"v":0,"d":"0.00"},null,{"v":0,"d":"0.00"},null,"PJ","Sleeping Bag Stuff Sack"]
[0,"Sleeping bag",{"v":82.6,"d":"83"},"Light weight Sleeping bag 5.16 lbs",1,null,{"v":0,"d":"0.00"},{"v":0,"d":"0.00"},{"v":0,"d":"0.00"},null,{"v":0,"d":"0.00"},null,"PJ","Sleeping Bag Stuff Sack"]
["Sleeping pad"]
[1,"Sleeping Pad",22,"Thermarest Trail Scout Regular",1,null,{"$f":"IF(E25=1,A25*C25,0)","v":{"v":22,"d":"22.00"}},{"$f":"G25/16","v":{"v":1.375,"d":"1.38"}},{"$f":"G25","v":{"v":22,"d":"22.00"}},null,{"$f":"IF(F25>=1,(A25*C25)/16,0)","v":{"v":0,"d":"0.00"}},null,"BP",{"$f":"_xlfn.XLOOKUP($M25,$A$319:$A$336,$B$319:$B$336,\"Not Found\")","v":"BackPack"}]
["Shelter"]
[1,"Hammock",{"v":22.3,"d":"22"},"Hennessey Ultra-Light Hammock, with stuff sack but NO Tarp",1,null,{"$f":"IF(E27=1,A27*C27,0)","v":{"v":22.3,"d":"22.30"}},{"$f":"G27/16","v":{"v":1.39375,"d":"1.39"}},{"$f":"G27","v":{"v":22.3,"d":"22.30"}},null,{"$f":"IF(F27>=1,(A27*C27)/16,0)","v":{"v":0,"d":"0.00"}},null,"BP",{"$f":"_xlfn.XLOOKUP($M27,$A$319:$A$336,$B$319:$B$336,\"Not Found\")","v":"BackPack"}]
[1,"Hammock Hardware",{"v":9.1,"d":"9"},"Hammock Hanging Hardware (2 bieners & 4 rap rings)",1,null,{"$f":"IF(E28=1,A28*C28,0)","v":{"v":9.1,"d":"9.10"}},{"$f":"G28/16","v":{"v":0.56875,"d":"0.57"}},{"$f":"G28","v":{"v":9.1,"d":"9.10"}},null,{"$f":"IF(F28>=1,(A28*C28)/16,0)","v":{"v":0,"d":"0.00"}},null,"BP","BackPack"]
[1,"Tent/tarp pegs",87,"Renee's tent",1,null,{"$f":"IF(E29=1,A29*C29,0)","v":{"v":87,"d":"87.00"}},{"$f":"G29/16","v":{"v":5.4375,"d":"5.44"}},{"$f":"G29","v":{"v":87,"d":"87.00"}},null,{"$f":"IF(F29>=1,(A29*C29)/16,0)","v":{"v":0,"d":"0.00"}},null,"BP","BackPack"]
[0,"Hammock Straps - Short",1,"Hammock Hanging straps - 2 short straps",1,null,{"v":0,"d":"0.00"},{"v":0,"d":"0.00"},{"v":0,"d":"0.00"},null,{"v":0,"d":"0.00"},null,"BP","BackPack"]
[1,"Rallt Tree Straps",{"v":12.1,"d":"12"},"Rallt Tree hammock hanging straps long - set of 2 straps",1,null,{"v":12.1,"d":"12.10"},{"v":0.75625,"d":"0.76"},{"v":12.1,"d":"12.10"},null,{"v":0,"d":"0.00"},null,"BP","BackPack"]
[1,"Tarp",{"v":23.8,"d":"24"},"Hennessey SiNylon tarp - Hex Fly + Snake Skins - Hammock cover",1,null,{"v":23.8,"d":"23.80"},{"v":1.4875,"d":"1.49"},{"v":23.8,"d":"23.80"},null,{"v":0,"d":"0.00"},null,"SC","Small Compression Sack"]
[1,"Tarp",{"v":23.8,"d":"24"},"Hennessey SiNylon tarp - Hex Fly + Snake Skins - Camp Tarp",1,null,{"v":23.8,"d":"23.80"},{"v":1.4875,"d":"1.49"},{"v":23.8,"d":"23.80"},null,{"v":0,"d":"0.00"},null,"SC","Small Compression Sack"]
[0,"Tarp",{"v":11.5,"d":"12"},"Hennessey SiNylon tarp - Small Hammock Cover - Original to Hammock",1,null,{"v":0,"d":"0.00"},{"v":0,"d":"0.00"},{"v":0,"d":"0.00"},null,{"v":0,"d":"0.00"},null,"BP","BackPack"]
[0,"Tarp",{"v":43.2,"d":"43"},"Lowes Plastic/Nylon Tarp W/ParaCord",1,null,{"v":0,"d":"0.00"},{"v":0,"d":"0.00"},{"v":0,"d":"0.00"},null,{"v":0,"d":"0.00"},null,"BP","BackPack"]
[10,"Tent/tarp pegs",{"v":0.5,"d":"1"},"Tent Stake(s)",1,null,{"v":5,"d":"5.00"},{"v":0.3125,"d":"0.31"},{"v":5,"d":"5.00"},null,{"v":0,"d":"0.00"},null,"BP","BackPack"]
[1,"Undercover for Hammock",{"v":5.75,"d":"6"},"UnderCover for Hammock ",1,null,5.75,{"v":0.359375,"d":"0.36"},5.75,null,{"v":0,"d":"0.00"},null,"BP","BackPack"]
[1,"UnderQuilt for Hammock",{"v":10.95,"d":"11"},"Underpad (aka underquilt) - With Stuff Sack",1,null,10.95,{"v":0.684375,"d":"0.68"},10.95,null,{"v":0,"d":"0.00"},null,"BP","BackPack"]
["Rain gear"]
[1,"Pant",{"v":9.9,"d":"10"},"Rain Gear (Pants)",1,null,{"$f":"IF(E40=1,A40*C40,0)","v":{"v":9.9,"d":"9.90"}},{"$f":"G40/16","v":{"v":0.61875,"d":"0.62"}},{"$f":"G40","v":{"v":9.9,"d":"9.90"}},null,{"$f":"IF(F40>=1,(A40*C40)/16,0)","v":{"v":0,"d":"0.00"}},null,"BP",{"$f":"_xlfn.XLOOKUP($M40,$A$319:$A$336,$B$319:$B$336,\"Not Found\")","v":"BackPack"}]
[0,"Top",{"v":12.1,"d":"12"},"Rain Gear (Top) Red Ledge jacket",1,null,{"$f":"IF(E41=1,A41*C41,0)","v":{"v":0,"d":"0.00"}},{"$f":"G41/16","v":{"v":0,"d":"0.00"}},{"$f":"G41","v":{"v":0,"d":"0.00"}},null,{"$f":"IF(F41>=1,(A41*C41)/16,0)","v":{"v":0,"d":"0.00"}},null,"BP",{"$f":"_xlfn.XLOOKUP($M41,$A$319:$A$336,$B$319:$B$336,\"Not Found\")","v":"BackPack"}]
[1,"Top",11,"Rain Gear (Top) Stohlquist spray jacket",1,null,{"v":11,"d":"11.00"},{"v":0.6875,"d":"0.69"},{"v":11,"d":"11.00"},null,{"v":0,"d":"0.00"},null,"BP",{"$f":"_xlfn.XLOOKUP($M42,$A$319:$A$336,$B$319:$B$336,\"Not Found\")","v":"BackPack"}]
[1,"Dry Suite",{"v":29.4,"d":"29"},"Kokatat Dry Suite",1,null,{"$f":"IF(E43=1,A43*C43,0)","v":{"v":29.4,"d":"29.40"}},{"$f":"G43/16","v":{"v":1.8375,"d":"1.84"}},{"$f":"G43","v":{"v":29.4,"d":"29.40"}},null,{"$f":"IF(F43>=1,(A43*C43)/16,0)","v":{"v":0,"d":"0.00"}},null,"BP",{"$f":"_xlfn.XLOOKUP($M43,$A$319:$A$336,$B$319:$B$336,\"Not Found\")","v":"BackPack"}]
["Stove"]
[0,"Alcohol Stove",{"v":5.9,"d":"6"},"OutAD Alcohol stove",1,null,{"$f":"IF(E45=1,A45*C45,0)","v":{"v":0,"d":"0.00"}},{"$f":"G45/16","v":{"v":0,"d":"0.00"}},{"$f":"G45","v":{"v":0,"d":"0.00"}},null,{"$f":"IF(F45>=1,(A45*C45)/16,0)","v":{"v":0,"d":"0.00"}},null,"BP",{"$f":"_xlfn.XLOOKUP($M45,$A$319:$A$336,$B$319:$B$336,\"Not Found\")","v":"BackPack"}]
[1,"Stove",{"v":12.6,"d":"13"},"MSR WhisperLite Stove",1,null,{"$f":"IF(E46=1,A46*C46,0)","v":{"v":12.6,"d":"12.60"}},{"$f":"G46/16","v":{"v":0.7875,"d":"0.79"}},{"$f":"G46","v":{"v":12.6,"d":"12.60"}},null,{"$f":"IF(F46>=1,(A46*C46)/16,0)","v":{"v":0,"d":"0.00"}},null,"BP",{"$f":"_xlfn.XLOOKUP($M46,$A$319:$A$336,$B$319:$B$336,\"Not Found\")","v":"BackPack"}]
[0,"Twig Stove",{"v":5.4,"d":"5"},"Emberlit-UL Backpacking stove",1,null,{"v":0,"d":"0.00"},{"v":0,"d":"0.00"},{"v":0,"d":"0.00"},null,{"v":0,"d":"0.00"},null,"BP",{"$f":"_xlfn.XLOOKUP($M47,$A$319:$A$336,$B$319:$B$336,\"Not Found\")","v":"BackPack"}]
[1,"Wind Screen",{"v":0.8,"d":"1"},"Titanium Wind Screen",1,null,{"v":0.8,"d":"0.80"},0.05,{"v":0.8,"d":"0.80"},null,{"v":0,"d":"0.00"},null,"BP",{"$f":"_xlfn.XLOOKUP($M48,$A$319:$A$336,$B$319:$B$336,\"Not Found\")","v":"BackPack"}]
[0,null,0,{"$nulls":3},{"v":0,"d":"0.00"},{"v":0,"d":"0.00"},{"v":0,"d":"0.00"},null,{"v":0,"d":"0.00"},null,"BP",{"$f":"_xlfn.XLOOKUP($M49,$A$319:$A$336,$B$319:$B$336,\"Not Found\")","v":"BackPack"}]
["Fuel"]
[0,"Alcohol ",16,"Total Volume of Alcohol in proper container(s)",1,null,{"$f":"IF(E51=1,A51*C51,0)","v":{"v":0,"d":"0.00"}},{"$f":"G51/16","v":{"v":0,"d":"0.00"}},{"$f":"G51","v":{"v":0,"d":"0.00"}},null,{"$f":"IF(F51>=1,(A51*C51)/16,0)","v":{"v":0,"d":"0.00"}},null,"BP",{"$f":"_xlfn.XLOOKUP($M51,$A$319:$A$336,$B$319:$B$336,\"Not Found\")","v":"BackPack"}]
[0,"Alcohol fuel bottle",{"v":1.4,"d":"1"},"Twin Neck Fuel bottle",1,null,{"$f":"IF(E52=1,A52*C52,0)","v":{"v":0,"d":"0.00"}},{"$f":"G52/16","v":{"v":0,"d":"0.00"}},{"$f":"G52","v":{"v":0,"d":"0.00"}},null,{"$f":"IF(F52>=1,(A52*C52)/16,0)","v":{"v":0,"d":"0.00"}},null,"BP",{"$f":"_xlfn.XLOOKUP($M52,$A$319:$A$336,$B$319:$B$336,\"Not Found\")","v":"BackPack"}]
[0,"Alcohol Fuel Bottle",8,"Alcohol small container",1,null,{"v":0,"d":"0.00"},{"v":0,"d":"0.00"},{"v":0,"d":"0.00"},null,{"v":0,"d":"0.00"},null,"BP",{"$f":"_xlfn.XLOOKUP($M53,$A$319:$A$336,$B$319:$B$336,\"Not Found\")","v":"BackPack"}]
[2,"Camp Fuel",28,"20  Fl. Oz. MSR Fuel Bottles - Full",1,null,{"v":56,"d":"56.00"},{"v":3.5,"d":"3.50"},{"v":56,"d":"56.00"},null,{"v":0,"d":"0.00"},null,"BP",{"$f":"_xlfn.XLOOKUP($M54,$A$319:$A$336,$B$319:$B$336,\"Not Found\")","v":"BackPack"}]
["Eating:"]
[0,"Camp Oven",{"v":14.3,"d":"14"},"Camp Oven - Old BSA Mess Kit ",1,null,{"$f":"IF(E56=1,A56*C56,0)","v":{"v":0,"d":"0.00"}},{"$f":"G56/16","v":{"v":0,"d":"0.00"}},{"$f":"G56","v":{"v":0,"d":"0.00"}},null,{"$f":"IF(F56>=1,(A56*C56)/16,0)","v":{"v":0,"d":"0.00"}},null,"FP",{"$f":"_xlfn.XLOOKUP($M56,$A$319:$A$336,$B$319:$B$336,\"Not Found\")","v":"Food Pack / Barrel"}]
[4,"Chop Sticks",{"v":0.3,"d":"0"},"Chop Sticks",1,null,{"$f":"IF(E57=1,A57*C57,0)","v":{"v":1.2,"d":"1.20"}},{"$f":"G57/16","v":{"v":0.075,"d":"0.08"}},{"$f":"G57","v":{"v":1.2,"d":"1.20"}},null,{"$f":"IF(F57>=1,(A57*C57)/16,0)","v":{"v":0,"d":"0.00"}},null,"BP","BackPack"]
[0,"Cutting Board",{"v":1.2,"d":"1"},"Plastic cutting board",null,3,{"v":0,"d":"0.00"},{"v":0,"d":"0.00"},{"v":0,"d":"0.00"},null,{"v":0,"d":"0.00"},null,"FP","Food Pack / Barrel"]
[0,"Egg Carton",{"v":3.9,"d":"4"},"1 Doz Plastic Egg Carton (empty)",null,3,{"v":0,"d":"0.00"},{"v":0,"d":"0.00"},{"v":0,"d":"0.00"},null,{"v":0,"d":"0.00"},null,"FP","Food Pack / Barrel"]
[1,"Egg Carton",{"v":2.1,"d":"2"},"1/2 Doz Plastic Egg Carton (empty)",null,3,{"$f":"IF(E60=1,A60*C60,0)","v":{"v":0,"d":"0.00"}},{"$f":"G60/16","v":{"v":0,"d":"0.00"}},{"$f":"G60","v":{"v":0,"d":"0.00"}},null,{"$f":"IF(F60>=1,(A60*C60)/16,0)","v":{"v":0.13125,"d":"0.13"}},null,"FP","Food Pack / Barrel"]
[1,"GSI Personal Java Press",{"v":10.8,"d":"11"},"GSI Personal Java Press",1,null,{"v":10.8,"d":"10.80"},{"v":0.675,"d":"0.68"},{"v":10.8,"d":"10.80"},null,{"v":0,"d":"0.00"},null,"BP","BackPack"]
[0,"Health Pro ",{"v":2.5,"d":"3"},"400 ml Fry Pan (Titanium) Approx 13.5 oz",1,null,{"v":0,"d":"0.00"},{"v":0,"d":"0.00"},{"v":0,"d":"0.00"},null,{"v":0,"d":"0.00"},null,"BP","BackPack"]
[0,"Health Pro ",{"v":4.3,"d":"4"},"1.2 L pot (Titanium) Approx 40 oz",1,null,{"v":0,"d":"0.00"},{"v":0,"d":"0.00"},{"v":0,"d":"0.00"},null,{"v":0,"d":"0.00"},null,"BP","BackPack"]
[0,"Health Pro ",{"v":3.5,"d":"4"},"800 ml pot (Titanium) Approx 27 oz",1,null,{"v":0,"d":"0.00"},{"v":0,"d":"0.00"},{"v":0,"d":"0.00"},null,{"v":0,"d":"0.00"},null,"BP","BackPack"]
[0,"Silicon Bread pans",{"v":16.3,"d":"16"},"Leukue Silicone bread pans",1,null,{"v":0,"d":"0.00"},{"v":0,"d":"0.00"},{"v":0,"d":"0.00"},null,{"v":0,"d":"0.00"},null,"FP","Food Pack / Barrel"]
[0,"Measuring Cup",{"v":0.7,"d":"1"},"Plastic Measuring Cup",1,null,{"v":0,"d":"0.00"},{"v":0,"d":"0.00"},{"v":0,"d":"0.00"},null,{"v":0,"d":"0.00"},null,"BP","BackPack"]
[0,"Grille Mat",{"v":1.4,"d":"1"},"Copper grill Mat (ea.) (I have 5)"," ",3,{"v":0,"d":"0.00"},{"v":0,"d":"0.00"},{"v":0,"d":"0.00"},null,{"v":0,"d":"0.00"},null,"FP","Food Pack / Barrel"]
[0,"Food Brush",{"v":0.5,"d":"1"},"Silicone Food Brush"," ",3,{"v":0,"d":"0.00"},{"v":0,"d":"0.00"},{"v":0,"d":"0.00"},null,{"v":0,"d":"0.00"},null,"FP","Food Pack / Barrel"]
[1,"Pot Cozy",{"v":1.9,"d":"2"},"DIY pot Cozy - SnowPeak",1,null,{"v":1.9,"d":"1.90"},{"v":0.11875,"d":"0.12"},{"v":1.9,"d":"1.90"},null,{"v":0,"d":"0.00"},null,"BP","BackPack"]
[0,"Pot Cozy",{"v":1.9,"d":"2"},"DIY pot Cozy - HealthPro 1.2l",1,null,{"v":0,"d":"0.00"},{"v":0,"d":"0.00"},{"v":0,"d":"0.00"},null,{"v":0,"d":"0.00"},null,"BP","BackPack"]
[0,"Pot Cozy",{"v":1.9,"d":"2"},"DIY pot Cozy - HealthPro 800ml",1,null,{"v":0,"d":"0.00"},{"v":0,"d":"0.00"},{"v":0,"d":"0.00"},null,{"v":0,"d":"0.00"},null,"BP","BackPack"]
[1,"Pot Lifter",{"v":1.5,"d":"2"},"Pot Lifter ",1,null,{"v":1.5,"d":"1.50"},{"v":0.09375,"d":"0.09"},{"v":1.5,"d":"1.50"},null,{"v":0,"d":"0.00"},null,"BP","BackPack"]
[1,"Mess Kit",{"v":45.2,"d":"45"},"Mess Kit - Fry pan, 2 pots 3 cups",1,null,{"v":45.2,"d":"45.20"},{"v":2.825,"d":"2.83"},{"v":45.2,"d":"45.20"},null,{"v":0,"d":"0.00"},null,"BP","BackPack"]
[0,"Silverware",{"v":0.4,"d":"0"}," Spork",1,null,{"v":0,"d":"0.00"},{"v":0,"d":"0.00"},{"v":0,"d":"0.00"},null,{"v":0,"d":"0.00"},null,"BP","BackPack"]
[0,"Silverware",{"v":2.4,"d":"2"},"Girl Scout set - Knife, Fork & Spoon",1,null,{"v":0,"d":"0.00"},{"v":0,"d":"0.00"},{"v":0,"d":"0.00"},null,{"v":0,"d":"0.00"},null,"BP","BackPack"]
[1,"SnowPeak Trek 900",{"v":6.2,"d":"6"},"30 oz pot and fry pan (Titanium) Approx 887 ml",1,null,{"v":6.2,"d":"6.20"},{"v":0.3875,"d":"0.39"},{"v":6.2,"d":"6.20"},null,{"v":0,"d":"0.00"},null,"BP","BackPack"]
[0,"Soup Thermos",{"v":6.6,"d":"7"},"Empty Thermos",null,3,{"v":0,"d":"0.00"},{"v":0,"d":"0.00"},{"v":0,"d":"0.00"},null,{"v":0,"d":"0.00"},null,"FP","Food Pack / Barrel"]
["Cutting"]
[0,"Axe",{"v":10.5,"d":"11"},"Small Camp Axe",1,null,{"$f":"IF(E79=1,A79*C79,0)","v":{"v":0,"d":"0.00"}},{"$f":"G79/16","v":{"v":0,"d":"0.00"}},{"$f":"G79","v":{"v":0,"d":"0.00"}},null,{"$f":"IF(F79>=1,(A79*C79)/16,0)","v":{"v":0,"d":"0.00"}},null,"BP",{"$f":"_xlfn.XLOOKUP($M79,$A$319:$A$336,$B$319:$B$336,\"Not Found\")","v":"BackPack"}]
[1,"Saw ",{"v":8.2,"d":"8"},"Pocket Boy Silky saw",null,3,{"$f":"IF(E80=1,A80*C80,0)","v":{"v":0,"d":"0.00"}},{"$f":"G80/16","v":{"v":0,"d":"0.00"}},{"$f":"G80","v":{"v":0,"d":"0.00"}},null,{"$f":"IF(F80>=1,(A80*C80)/16,0)","v":{"v":0.5125,"d":"0.51"}},null,"BP",{"$f":"_xlfn.XLOOKUP($M80,$A$319:$A$336,$B$319:$B$336,\"Not Found\")","v":"BackPack"}]
[0,"Saw",{"v":13.1,"d":"13"},"Sven Camp Saw",1,null,{"v":0,"d":"0.00"},{"v":0,"d":"0.00"},{"v":0,"d":"0.00"},null,{"v":0,"d":"0.00"},null,"BP",{"$f":"_xlfn.XLOOKUP($M81,$A$319:$A$336,$B$319:$B$336,\"Not Found\")","v":"BackPack"}]
["Water:"]
[0,"Gal of water",128,"1 gal of water",1,null,{"v":0,"d":"0.00"},{"v":0,"d":"0.00"},{"v":0,"d":"0.00"},null,{"v":0,"d":"0.00"},null,"BP",{"$f":"_xlfn.XLOOKUP($M83,$A$319:$A$336,$B$319:$B$336,\"Not Found\")","v":"BackPack"}]
[6,"Liter of Water",{"v":35.204,"d":"35"},"1 gal of water",1,null,{"$f":"IF(E84=1,A84*C84,0)","v":{"v":211.224,"d":"211.22"}},{"$f":"G84/16","v":{"v":13.2015,"d":"13.20"}},{"$f":"G84","v":{"v":211.224,"d":"211.22"}},null,{"$f":"IF(F84>=1,(A84*C84)/16,0)","v":{"v":0,"d":"0.00"}},null,"BP","BackPack"]
[0,"Hydration System",{"v":6.2,"d":"6"},"Platypus Big Zip LP 3.0L empty",1,null,{"v":0,"d":"0.00"},{"v":0,"d":"0.00"},{"v":0,"d":"0.00"},null,{"v":0,"d":"0.00"},null,"BP","BackPack"]
[1,"Water Bottle",{"v":38.2,"d":"38"},"32 Oz. Nalgene full (6.3 oz empty) ",1,null,{"v":38.2,"d":"38.20"},{"v":2.3875,"d":"2.39"},{"v":38.2,"d":"38.20"},null,{"v":0,"d":"0.00"},null,"BP","BackPack"]
[0,"Water Bottle",{"v":29.3,"d":"29"},"22 Oz. LifeStraw Go bottle full (7.3 oz empty)",1,null,{"v":0,"d":"0.00"},{"v":0,"d":"0.00"},{"v":0,"d":"0.00"},null,{"v":0,"d":"0.00"},null,"BP","BackPack"]
[0,"Water treatment system",{"v":11.5,"d":"12"},"Platypus Gravity Works 4.0L empty",1,null,{"v":0,"d":"0.00"},{"v":0,"d":"0.00"},{"v":0,"d":"0.00"},null,{"v":0,"d":"0.00"},null,"BP","BackPack"]
["Personal Gear:"]
["Directional/Safety"]
[1,"Bivvy",{"v":3.8,"d":"4"},"SOL Bivvy",1,null,{"$f":"IF(E91=1,A91*C91,0)","v":{"v":3.8,"d":"3.80"}},{"$f":"G91/16","v":{"v":0.2375,"d":"0.24"}},{"$f":"G91","v":{"v":3.8,"d":"3.80"}},null,{"$f":"IF(F91>=1,(A91*C91)/16,0)","v":{"v":0,"d":"0.00"}},null,"DK",{"$f":"_xlfn.XLOOKUP($M91,$A$319:$A$336,$B$319:$B$336,\"Not Found\")","v":"Ditch Kit"}]
[1,"Blue Whistle",{"v":0.8,"d":"1"},"Blue Whistle",1,null,{"$f":"IF(E92=1,A92*C92,0)","v":{"v":0.8,"d":"0.80"}},{"$f":"G92/16","v":0.05},{"$f":"G92","v":{"v":0.8,"d":"0.80"}},null,{"$f":"IF(F92>=1,(A92*C92)/16,0)","v":{"v":0,"d":"0.00"}},null,"DK",{"$f":"_xlfn.XLOOKUP($M92,$A$319:$A$336,$B$319:$B$336,\"Not Found\")","v":"Ditch Kit"}]
[1,"Clip-on Compas",{"v":0.6,"d":"1"},"TwinGage Clip-on Compas",1,null,{"v":0.6,"d":"0.60"},{"v":0.0375,"d":"0.04"},{"v":0.6,"d":"0.60"},null,{"v":0,"d":"0.00"},null,"DK",{"$f":"_xlfn.XLOOKUP($M93,$A$319:$A$336,$B$319:$B$336,\"Not Found\")","v":"Ditch Kit"}]
[1,"Compass",{"v":0.6,"d":"1"},"Starter brand Compas",1,null,{"v":0.6,"d":"0.60"},{"v":0.0375,"d":"0.04"},{"v":0.6,"d":"0.60"},null,{"v":0,"d":"0.00"},null,"DK",{"$f":"_xlfn.XLOOKUP($M94,$A$319:$A$336,$B$319:$B$336,\"Not Found\")","v":"Ditch Kit"}]
[0,"Compass",{"v":1.8,"d":"2"},"Water Filled Compass",1,null,{"v":0,"d":"0.00"},{"v":0,"d":"0.00"},{"v":0,"d":"0.00"},null,{"v":0,"d":"0.00"},null,"DK"]
[1,"Emergency Blanket",{"v":1.8,"d":"2"},"Emergency Blanket for ditch kit and Use with Under-quilt/Air mattres",1,null,{"v":1.8,"d":"1.80"},{"v":0.1125,"d":"0.11"},{"v":1.8,"d":"1.80"},null,{"v":0,"d":"0.00"},null,"DK",{"$f":"_xlfn.XLOOKUP($M96,$A$319:$A$336,$B$319:$B$336,\"Not Found\")","v":"Ditch Kit"}]
[0,"Garmin eTrex",{"v":6.6,"d":"7"},"Garmin eTrex GPS device - With 2 rechargeable batteries - AA",1,null,{"v":0,"d":"0.00"},{"v":0,"d":"0.00"},{"v":0,"d":"0.00"},null,{"v":0,"d":"0.00"},null,"DK","Ditch Kit"]
[0,"Map",3,"Jeff's Waterproof Maps per section",1,null,{"v":0,"d":"0.00"},{"v":0,"d":"0.00"},{"v":0,"d":"0.00"},null,{"v":0,"d":"0.00"},null,"DK","Ditch Kit"]
[0,"Map",{"v":3.1,"d":"3"},"Quetico Waterproof map",1,null,{"$f":"IF(E99=1,A99*C99,0)","v":{"v":0,"d":"0.00"}},{"$f":"G99/16","v":{"v":0,"d":"0.00"}},{"$f":"G99","v":{"v":0,"d":"0.00"}},null,{"$f":"IF(F99>=1,(A99*C99)/16,0)","v":{"v":0,"d":"0.00"}},null,"DK","Ditch Kit"]
[1,"Spot PLD",6,"Spot Personl Location device (with Batteries)",1," ",{"v":6,"d":"6.00"},{"v":0.375,"d":"0.38"},{"v":6,"d":"6.00"},null,{"v":0.375,"d":"0.38"},null,"DK","Ditch Kit"]
[0,"Whistle/compas/mirror",{"v":1.1,"d":"1"},"Whistle/compas/mirror",1,null,{"v":0,"d":"0.00"},{"v":0,"d":"0.00"},{"v":0,"d":"0.00"},null,{"v":0,"d":"0.00"},null,"DK","Ditch Kit"]
[1,"PFD",27,"Chinook PFD",null,1,{"v":0,"d":"0.00"},{"v":0,"d":"0.00"},{"v":0,"d":"0.00"},null,{"v":1.6875,"d":"1.69"},null,"OP","On Person"]
[0,"Boat Safety Kit",{"v":14.5,"d":"15"},"Fox 40 Boat Essential safety kit",null,3,{"$f":"IF(E103=1,A103*C103,0)","v":{"v":0,"d":"0.00"}},{"$f":"G103/16","v":{"v":0,"d":"0.00"}},{"$f":"G103","v":{"v":0,"d":"0.00"}},null,{"$f":"IF(F103>=1,(A103*C103)/16,0)","v":{"v":0,"d":"0.00"}},null,"C","Canoe"]
["Knife"]
[0,"Buck",{"v":7.1,"d":"7"},"Buck Sheath Knife",null,1,{"$f":"IF(E105=1,A105*C105,0)","v":{"v":0,"d":"0.00"}},{"$f":"G105/16","v":{"v":0,"d":"0.00"}},{"$f":"G105","v":{"v":0,"d":"0.00"}},null,{"$f":"IF(F105>=1,(A105*C105)/16,0)","v":{"v":0,"d":"0.00"}},null,"OP",{"$f":"_xlfn.XLOOKUP($M105,$A$319:$A$336,$B$319:$B$336,\"Not Found\")","v":"On Person"}]
[0,"Fillet",{"v":3.4,"d":"3"},"Fishing Fillet knife",null,3,{"$f":"IF(E106=1,A106*C106,0)","v":{"v":0,"d":"0.00"}},{"$f":"G106/16","v":{"v":0,"d":"0.00"}},{"$f":"G106","v":{"v":0,"d":"0.00"}},null,{"$f":"IF(F106>=1,(A106*C106)/16,0)","v":{"v":0,"d":"0.00"}},null,"FG","Fishing / Camera Gear Pack"]
[1,"Multi Tool",{"v":7.7,"d":"8"},"Multi Tool (Leatherman w/holster)",null,1,{"v":0,"d":"0.00"},{"v":0,"d":"0.00"},{"v":0,"d":"0.00"},null,{"v":0.48125,"d":"0.48"},null,"OP","On Person"]
[0,"Multi Tool",{"v":7.3,"d":"7"},"Multi Tool (Gerber)",null,1,{"v":0,"d":"0.00"},{"v":0,"d":"0.00"},{"v":0,"d":"0.00"},null,{"v":0,"d":"0.00"},null,"OP","On Person"]
[1,"Swiss Army Knife",{"v":1.7,"d":"2"},"Swiss Army Knife",null,1,{"v":0,"d":"0.00"},{"v":0,"d":"0.00"},{"v":0,"d":"0.00"},null,{"v":0.10625,"d":"0.11"},null,"OP","On Person"]
[0,"Whittlin' Jack",{"v":2.9,"d":"3"},"Whittlin' Jack pocket knife",1,null,{"v":0,"d":"0.00"},{"v":0,"d":"0.00"},{"v":0,"d":"0.00"},null,{"v":0,"d":"0.00"},null,"BP","BackPack"]
["Toiletries"]
[1,"Biodegradable soap",{"v":3.5,"d":"4"},"Campsuds",1,null,{"$f":"IF(E112=1,A112*C112,0)","v":{"v":3.5,"d":"3.50"}},{"$f":"G112/16","v":{"v":0.21875,"d":"0.22"}},{"$f":"G112","v":{"v":3.5,"d":"3.50"}},null,{"$f":"IF(F112>=1,(A112*C112)/16,0)","v":{"v":0,"d":"0.00"}},null,"BP",{"$f":"_xlfn.XLOOKUP($M112,$A$319:$A$336,$B$319:$B$336,\"Not Found\")","v":"BackPack"}]
[3,"Flushable wipes",{"v":8.4,"d":"8"},"Cottonelle Wipes",1,null,{"$f":"IF(E113=1,A113*C113,0)","v":{"v":25.200000000000003,"d":"25.20"}},{"$f":"G113/16","v":{"v":1.5750000000000002,"d":"1.58"}},{"$f":"G113","v":{"v":25.200000000000003,"d":"25.20"}},null,{"$f":"IF(F113>=1,(A113*C113)/16,0)","v":{"v":0,"d":"0.00"}},null,"BP","BackPack"]
[1,"Comb",{"v":0.2,"d":"0"},"Comb",null,1,{"v":0,"d":"0.00"},{"v":0,"d":"0.00"},{"v":0,"d":"0.00"},null,{"v":0.0125,"d":"0.01"},null,"OP","On Person"]
[1,"Dental Floss",{"v":0.2,"d":"0"},"Dental Floss",1,null,{"v":0.2,"d":"0.20"},{"v":0.0125,"d":"0.01"},{"v":0.2,"d":"0.20"},null,{"v":0,"d":"0.00"},null,"BP","BackPack"]
[0,"Deodorant",{"v":0.3,"d":"0"},"Flight sized deodorant",1,null,{"v":0,"d":"0.00"},{"v":0,"d":"0.00"},{"v":0,"d":"0.00"},null,{"v":0,"d":"0.00"},null,"BP","BackPack"]
[60,"Medications",1,"One daily dose (both AM & PM) meds",1,null,{"v":60,"d":"60.00"},3.75,{"v":60,"d":"60.00"},null,{"v":0,"d":"0.00"},null,"DK","Ditch Kit"]
[1,"Metal Mirror",{"v":1.3,"d":"1"},"Metal Mirror - Use it for grooming & as an emergency signal device",1,null,{"v":1.3,"d":"1.30"},{"v":0.08125,"d":"0.08"},{"v":1.3,"d":"1.30"},null,{"v":0,"d":"0.00"},null,"BP","BackPack"]
[1,"Perscription Med",{"v":0.5,"d":"1"},"Nitrostat (Nitro for Heart emerg)",1,null,{"v":0.5,"d":"0.50"},{"v":0.03125,"d":"0.03"},{"v":0.5,"d":"0.50"},null,{"v":0,"d":"0.00"},null,"DK","Ditch Kit"]
[3,"Razor",{"v":0.2,"d":"0"},"Bick Rasor",1,null,{"v":0.6000000000000001,"d":"0.60"},{"v":0.037500000000000006,"d":"0.04"},{"v":0.6000000000000001,"d":"0.60"},null,{"v":0,"d":"0.00"},null,"BP","BackPack"]
[2,"Toilet paper",{"v":5.5,"d":"6"},"TP",1,null,{"v":11,"d":"11.00"},{"v":0.6875,"d":"0.69"},{"v":11,"d":"11.00"},null,{"v":0,"d":"0.00"},null,"DK","Ditch Kit"]
[0,"Toothbrush",1,"Tooth Brush / in case",1,null,{"v":0,"d":"0.00"},{"v":0,"d":"0.00"},{"v":0,"d":"0.00"},null,{"v":0,"d":"0.00"},null,"BP","BackPack"]
[0,"Toothpaste",{"v":4.1,"d":"4"},"Tube of Toothpaste",1,null,{"v":0,"d":"0.00"},{"v":0,"d":"0.00"},{"v":0,"d":"0.00"},null,{"v":0,"d":"0.00"},null,"BP","BackPack"]
[2,"Towel",{"v":1.8,"d":"2"},"Chamis towel",1,null,{"v":3.6,"d":"3.60"},{"v":0.225,"d":"0.23"},{"v":3.6,"d":"3.60"},null,{"v":0,"d":"0.00"},null,"BP","BackPack"]
[1,"Trowl",1,"Cat hole trowl",1,null,{"$f":"IF(E125=1,A125*C125,0)","v":{"v":1,"d":"1.00"}},{"$f":"G125/16","v":{"v":0.0625,"d":"0.06"}},{"$f":"G125","v":{"v":1,"d":"1.00"}},null,{"$f":"IF(F125>=1,(A125*C125)/16,0)","v":{"v":0,"d":"0.00"}},null,"BP","BackPack"]
["First Aid / Emergency"]
[1,"Duct Tape",{"v":2.8,"d":"3"},"Part of larger Duct Tape roll",1,null,{"$f":"IF(E127=1,A127*C127,0)","v":{"v":2.8,"d":"2.80"}},{"$f":"G127/16","v":{"v":0.175,"d":"0.18"}},{"$f":"G127","v":{"v":2.8,"d":"2.80"}},null,{"$f":"IF(F127>=1,(A127*C127)/16,0)","v":{"v":0,"d":"0.00"}},null,"DK",{"$f":"_xlfn.XLOOKUP($M127,$A$319:$A$336,$B$319:$B$336,\"Not Found\")","v":"Ditch Kit"}]
[1,"First aid kit",{"v":2.4,"d":"2"},"Coghlans - First Aid kit",1,null,{"v":2.4,"d":"2.40"},0.15,{"v":2.4,"d":"2.40"},null,{"v":0,"d":"0.00"},null,"DK","Ditch Kit"]
[1,"Matches",{"v":0.9,"d":"1"},"box of small wooden matches",1,null,{"v":0.9,"d":"0.90"},{"v":0.05625,"d":"0.06"},{"v":0.9,"d":"0.90"},null,{"v":0,"d":"0.00"},null,"DK","Ditch Kit"]
[1,"Moleskin",{"v":0.7,"d":"1"},"Three sheets of MoleSkin",1,null,{"v":0.7,"d":"0.70"},{"v":0.04375,"d":"0.04"},{"v":0.7,"d":"0.70"},null,{"v":0,"d":"0.00"},null,"DK","Ditch Kit"]
[1,"Pain Meds",{"v":0.5,"d":"1"},"12 Asprin & 6 Aleve",1,null,{"v":0.5,"d":"0.50"},{"v":0.03125,"d":"0.03"},{"v":0.5,"d":"0.50"},null,{"v":0,"d":"0.00"},null,"DK","Ditch Kit"]
[1,"Thread",{"v":1.3,"d":"1"},"Waxed Thead - spool",1,null,{"v":1.3,"d":"1.30"},{"v":0.08125,"d":"0.08"},{"v":1.3,"d":"1.30"},null,{"v":0,"d":"0.00"},null,"DK","Ditch Kit"]
[1,"Twine",{"v":1.4,"d":"1"},"Waxed Twine",1,null,{"v":1.4,"d":"1.40"},{"v":0.0875,"d":"0.09"},{"v":1.4,"d":"1.40"},null,{"v":0,"d":"0.00"},null,"DK","Ditch Kit"]
["Rope / Line"]
[1,"Cord",{"v":5.1,"d":"5"},"25 feet extra Para Cord",1,null,{"$f":"IF(E135=1,A135*C135,0)","v":{"v":5.1,"d":"5.10"}},{"$f":"G135/16","v":{"v":0.31875,"d":"0.32"}},{"$f":"G135","v":{"v":5.1,"d":"5.10"}},null,{"$f":"IF(F135>=1,(A135*C135)/16,0)","v":{"v":0,"d":"0.00"}},null,"DK",{"$f":"_xlfn.XLOOKUP($M135,$A$319:$A$336,$B$319:$B$336,\"Not Found\")","v":"Ditch Kit"}]
[0,"Garbage bag",{"v":0.4,"d":"0"},"Large bag (10-1/2 x 12\")",1,null,{"$f":"IF(E136=1,A136*C136,0)","v":{"v":0,"d":"0.00"}},{"$f":"G136/16","v":{"v":0,"d":"0.00"}},{"$f":"G136","v":{"v":0,"d":"0.00"}},null,{"$f":"IF(F136>=1,(A136*C136)/16,0)","v":{"v":0,"d":"0.00"}},null,"DK",{"$f":"_xlfn.XLOOKUP($M136,$A$319:$A$336,$B$319:$B$336,\"Not Found\")","v":"Ditch Kit"}]
[0,"Line",{"v":7.1,"d":"7"},"100 ft. Paracord for Bear bag",1,null,{"v":0,"d":"0.00"},{"v":0,"d":"0.00"},{"v":0,"d":"0.00"},null,{"v":0,"d":"0.00"},null,"DK",{"$f":"_xlfn.XLOOKUP($M137,$A$319:$A$336,$B$319:$B$336,\"Not Found\")","v":"Ditch Kit"}]
[0,"Line",{"v":15.3,"d":"15"},"100 ft. nylon rope for Bear Bag ",1,null,{"v":0,"d":"0.00"},{"v":0,"d":"0.00"},{"v":0,"d":"0.00"},null,{"v":0,"d":"0.00"},null,"DK",{"$f":"_xlfn.XLOOKUP($M138,$A$319:$A$336,$B$319:$B$336,\"Not Found\")","v":"Ditch Kit"}]
[0,"Line",{"v":9.4,"d":"9"},"Throw Line ball of twine",1,null,{"v":0,"d":"0.00"},{"v":0,"d":"0.00"},{"v":0,"d":"0.00"},null,{"v":0,"d":"0.00"},null,"DK",{"$f":"_xlfn.XLOOKUP($M139,$A$319:$A$336,$B$319:$B$336,\"Not Found\")","v":"Ditch Kit"}]
["Light"]
[1,"Headlamp",{"v":1.3,"d":"1"},"Coleman Headlamp (with-out Batteries)",1,null,{"$f":"IF(E141=1,A141*C141,0)","v":{"v":1.3,"d":"1.30"}},{"$f":"G141/16","v":{"v":0.08125,"d":"0.08"}},{"$f":"G141","v":{"v":1.3,"d":"1.30"}},null,{"$f":"IF(F141>=1,(A141*C141)/16,0)","v":{"v":0,"d":"0.00"}},null,"PJ",{"$f":"_xlfn.XLOOKUP($M141,$A$319:$A$336,$B$319:$B$336,\"Not Found\")","v":"Sleeping Bag Stuff Sack"}]
[1,"Headlamp",{"v":2.2,"d":"2"},"LuxPro Headlamp - Rechargeable (with cabel)",1,null,{"$f":"IF(E142=1,A142*C142,0)","v":{"v":2.2,"d":"2.20"}},{"$f":"G142/16","v":{"v":0.1375,"d":"0.14"}},{"$f":"G142","v":{"v":2.2,"d":"2.20"}},null,{"$f":"IF(F142>=1,(A142*C142)/16,0)","v":{"v":0,"d":"0.00"}},null,"PJ",{"$f":"_xlfn.XLOOKUP($M142,$A$319:$A$336,$B$319:$B$336,\"Not Found\")","v":"Sleeping Bag Stuff Sack"}]
[0,"MagLite",{"v":3.78,"d":"4"},"Small MagLite (without Batteries)",1,null,{"v":0,"d":"0.00"},{"v":0,"d":"0.00"},{"v":0,"d":"0.00"},null,{"v":0,"d":"0.00"},null,"PJ",{"$f":"_xlfn.XLOOKUP($M143,$A$319:$A$336,$B$319:$B$336,\"Not Found\")","v":"Sleeping Bag Stuff Sack"}]
["Glasses"]
[2,"Reading glasses",{"v":0.6,"d":"1"},"2X Reading Glasses from CVS",1,null,{"$f":"IF(E145=1,A145*C145,0)","v":{"v":1.2,"d":"1.20"}},{"$f":"G145/16","v":{"v":0.075,"d":"0.08"}},{"$f":"G145","v":{"v":1.2,"d":"1.20"}},null,{"$f":"IF(F145>=1,(A145*C145)/16,0)","v":{"v":0,"d":"0.00"}},null,"BP",{"$f":"_xlfn.XLOOKUP($M145,$A$319:$A$336,$B$319:$B$336,\"Not Found\")","v":"BackPack"}]
[1,"Sunglasses",{"v":1.1,"d":"1"},"Dwalt Shock resistant Sunglasses",null,1,{"v":0,"d":"0.00"},{"v":0,"d":"0.00"},{"v":0,"d":"0.00"},null,{"v":0.06875,"d":"0.07"},null,"OP",{"$f":"_xlfn.XLOOKUP($M146,$A$319:$A$336,$B$319:$B$336,\"Not Found\")","v":"On Person"}]
["Batteries"]
[0,"AA Alkaline Batteries",{"v":0.81,"d":"1"},"Mag lite Batteries (AA Alkaline)",1,null,{"$f":"IF(E148=1,A148*C148,0)","v":{"v":0,"d":"0.00"}},{"$f":"G148/16","v":{"v":0,"d":"0.00"}},{"$f":"G148","v":{"v":0,"d":"0.00"}},null,{"$f":"IF(F148>=1,(A148*C148)/16,0)","v":{"v":0,"d":"0.00"}},null,"RS",{"$f":"_xlfn.XLOOKUP($M148,$A$319:$A$336,$B$319:$B$336,\"Not Found\")","v":"Red Stuff Sack"}]
[0,"AA Lithium Batteries",{"v":0.5,"d":"1"},"Mag lite/Garmin Batteries (AA Lithium)",1,null,{"v":0,"d":"0.00"},{"v":0,"d":"0.00"},{"v":0,"d":"0.00"},null,{"v":0,"d":"0.00"},null,"BP","BackPack"]
[8,"AAA Alkaline Batteries",{"v":0.4,"d":"0"},"Headlamp Batteries (AAA Alkaline)",1,null,{"v":3.2,"d":"3.20"},{"v":0.2,"d":"0.20"},{"v":3.2,"d":"3.20"},null,{"v":0,"d":"0.00"},null,"BP","BackPack"]
[4,"AAA Lithium Batteries",{"v":0.3,"d":"0"},"Spot & Headlamp Batteries (AAA Lithium)",1,null,{"v":1.2,"d":"1.20"},{"v":0.075,"d":"0.08"},{"v":1.2,"d":"1.20"},null,{"v":0,"d":"0.00"},null,"BP","BackPack"]
[1,"Charging cabel fro Samsung",{"v":1.1,"d":"1"},"Charging Cabel - USB/USB C",1,null,{"v":1.1,"d":"1.10"},{"v":0.06875,"d":"0.07"},{"v":1.1,"d":"1.10"},null,{"v":0,"d":"0.00"},null,"BP","BackPack"]
[3,"LimeFuel - Aux battery pack",13,"Limefuel Battery pack to recharge phone, Cannon and GoPro",1,null,{"v":39,"d":"39.00"},{"v":2.4375,"d":"2.44"},{"v":39,"d":"39.00"},null,{"v":0,"d":"0.00"},null,"RS","Red Stuff Sack"]
[1,"Solar Charger",{"v":23.3,"d":"23"},"Big Blue Solar Charger",1,null,{"$f":"IF(E154=1,A154*C154,0)","v":{"v":23.3,"d":"23.30"}},{"$f":"G154/16","v":{"v":1.45625,"d":"1.46"}},{"$f":"G154","v":{"v":23.3,"d":"23.30"}},null,{"$f":"IF(F154>=1,(A154*C154)/16,0)","v":{"v":0,"d":"0.00"}},null,"RS","Red Stuff Sack"]
["Accessories:","Accessories:"]
[2,"Gloves",{"v":6.9,"d":"7"},"Gloves - Kombi WaterGuard - Set",null,1,{"$f":"IF(E156=1,A156*C156,0)","v":{"v":0,"d":"0.00"}},{"$f":"G156/16","v":{"v":0,"d":"0.00"}},{"$f":"G156","v":{"v":0,"d":"0.00"}},null,{"$f":"IF(F156>=1,(A156*C156)/16,0)","v":{"v":0.8625,"d":"0.86"}},null,"OP",{"$f":"_xlfn.XLOOKUP($M156,$A$319:$A$336,$B$319:$B$336,\"Not Found\")","v":"On Person"}]
[1,"AquaSeal Patch Kit",{"v":0.8,"d":"1"},"AquaSeal Patch Kit",1,null,{"$f":"IF(E157=1,A157*C157,0)","v":{"v":0.8,"d":"0.80"}},{"$f":"G157/16","v":0.05},{"$f":"G157","v":{"v":0.8,"d":"0.80"}},null,{"$f":"IF(F157>=1,(A157*C157)/16,0)","v":{"v":0,"d":"0.00"}},null,"DK","Ditch Kit"]
[0,"Binoculars",{"v":11.6,"d":"12"},"10x25 Binioculars",null,3,{"v":0,"d":"0.00"},{"v":0,"d":"0.00"},{"v":0,"d":"0.00"},null,{"v":0,"d":"0.00"},null,"OG","Other Gear"]
[1,"Bucket",4,"Colapsable bucket",1,null,{"v":4,"d":"4.00"},0.25,{"v":4,"d":"4.00"},null,{"v":0,"d":"0.00"},null,"DK","Ditch Kit"]
[0,"Camera",{"v":6.5,"d":"7"},"Nikon CoolPix L22",1,null,{"v":0,"d":"0.00"},{"v":0,"d":"0.00"},{"v":0,"d":"0.00"},null,{"v":0,"d":"0.00"},null,"RS","Red Stuff Sack"]
[0,"Camera",{"v":5.7,"d":"6"},"GoPro Hero 3 camera w/small rechargeable battery",1,null,{"v":0,"d":"0.00"},{"v":0,"d":"0.00"},{"v":0,"d":"0.00"},null,{"v":0,"d":"0.00"},null,"RS","Red Stuff Sack"]
[1,"Camera",{"v":5.7,"d":"6"},"GoPro Hero 3 camera w/large rechargeable battery",null,1,{"v":0,"d":"0.00"},{"v":0,"d":"0.00"},{"v":0,"d":"0.00"},null,{"v":0.35625,"d":"0.36"},null,"RS","Red Stuff Sack"]
[1,"Camera",{"v":10.2,"d":"10"},"Olympus Tough 6 camera w/ battery",null,1,{"$f":"IF(E163=1,A163*C163,0)","v":{"v":0,"d":"0.00"}},{"$f":"G163/16","v":{"v":0,"d":"0.00"}},{"$f":"G163","v":{"v":0,"d":"0.00"}},null,{"$f":"IF(F163>=1,(A163*C163)/16,0)","v":{"v":0.6375,"d":"0.64"}},null,"RS","Red Stuff Sack"]
[2,"Camera Accessory",{"v":0.9,"d":"1"},"GoPro reg batteries",1,null,{"v":1.8,"d":"1.80"},{"v":0.1125,"d":"0.11"},{"v":1.8,"d":"1.80"},null,{"v":0,"d":"0.00"},null,"RS","Red Stuff Sack"]
[3,"Camera Accessory",{"v":0.9,"d":"1"},"Olympus Tough reg batteries",1,null,{"$f":"IF(E165=1,A165*C165,0)","v":{"v":2.7,"d":"2.70"}},{"$f":"G165/16","v":{"v":0.16875,"d":"0.17"}},{"$f":"G165","v":{"v":2.7,"d":"2.70"}},null,{"$f":"IF(F165>=1,(A165*C165)/16,0)","v":{"v":0,"d":"0.00"}},null,"RS","Red Stuff Sack"]
[1,"Camera Accessory",{"v":0.9,"d":"1"},"GoPro battery USB Charger",1,null,{"v":0.9,"d":"0.90"},{"v":0.05625,"d":"0.06"},{"v":0.9,"d":"0.90"},null,{"v":0,"d":"0.00"},null,"RS","Red Stuff Sack"]
[1,"Camera Accessory",{"v":0.9,"d":"1"},"Olympus Tough battery USB Charger",1,null,{"$f":"IF(E167=1,A167*C167,0)","v":{"v":0.9,"d":"0.90"}},{"$f":"G167/16","v":{"v":0.05625,"d":"0.06"}},{"$f":"G167","v":{"v":0.9,"d":"0.90"}},null,{"$f":"IF(F167>=1,(A167*C167)/16,0)","v":{"v":0,"d":"0.00"}},null,"RS","Red Stuff Sack"]
[0,"Camera Accessory",{"v":0.6,"d":"1"},"GoPro back for reg batteries",1,null,{"v":0,"d":"0.00"},{"v":0,"d":"0.00"},{"v":0,"d":"0.00"},null,{"v":0,"d":"0.00"},null,"RS","Red Stuff Sack"]
[0,"Camera Accessory",{"v":0.4,"d":"0"},"GoPro open back",1,null,{"v":0,"d":"0.00"},{"v":0,"d":"0.00"},{"v":0,"d":"0.00"},null,{"v":0,"d":"0.00"},null,"RS","Red Stuff Sack"]
[0,"Camera Accessory",{"v":12.9,"d":"13"},"Camera Mount",1,null,{"v":0,"d":"0.00"},{"v":0,"d":"0.00"},{"v":0,"d":"0.00"},null,{"v":0,"d":"0.00"},null,"RS","Red Stuff Sack"]
[0,"Camera Accessory",{"v":16.5,"d":"17"},"SLR Waterproof Case",null,2,{"v":0,"d":"0.00"},{"v":0,"d":"0.00"},{"v":0,"d":"0.00"},null,{"v":0,"d":"0.00"},null,"C","Canoe"]
[0,"Camera Accessory",{"v":1.8,"d":"2"},"SLR Rain Sleeve",null,2,{"v":0,"d":"0.00"},{"v":0,"d":"0.00"},{"v":0,"d":"0.00"},null,{"v":0,"d":"0.00"},null,"FG","Fishing / Camera Gear Pack"]
[0,"Camera",{"v":18.4,"d":"18"},"Cannon EOS T6",null,2,{"v":0,"d":"0.00"},{"v":0,"d":"0.00"},{"v":0,"d":"0.00"},null,{"v":0,"d":"0.00"},null,"FG","Fishing / Camera Gear Pack"]
[0,"Camera lense 18-55 mm",{"v":7.8,"d":"8"},"Cannon 18-55 mm lense",null,2,{"v":0,"d":"0.00"},{"v":0,"d":"0.00"},{"v":0,"d":"0.00"},null,{"v":0,"d":"0.00"},null,"FG","Fishing / Camera Gear Pack"]
[0,"Camera lense 75-300 mm",{"v":17.8,"d":"18"},"Cannon 75-300 mm Lense",null,2,{"v":0,"d":"0.00"},{"v":0,"d":"0.00"},{"v":0,"d":"0.00"},null,{"v":0,"d":"0.00"},null,"FG","Fishing / Camera Gear Pack"]
[0,"Camera lense 50 mm ",{"v":7.8,"d":"8"},"Cannon 50 mm Lense",null,2,{"v":0,"d":"0.00"},{"v":0,"d":"0.00"},{"v":0,"d":"0.00"},null,{"v":0,"d":"0.00"},null,"FG","Fishing / Camera Gear Pack"]
[0,"Camera lense 10-22 mm ",{"v":15.8,"d":"16"},"Cannon 10-22 mm Lense",null,2,{"$f":"IF(E177=1,A177*C177,0)","v":{"v":0,"d":"0.00"}},{"$f":"G177/16","v":{"v":0,"d":"0.00"}},{"$f":"G177","v":{"v":0,"d":"0.00"}},null,{"$f":"IF(F177>=1,(A177*C177)/16,0)","v":{"v":0,"d":"0.00"}},null,"FG","Fishing / Camera Gear Pack"]
[0,"Camera  Pack",{"v":30.8,"d":"31"},"Camera pack ",null,2,{"v":0,"d":"0.00"},{"v":0,"d":"0.00"},{"v":0,"d":"0.00"},null,{"v":0,"d":"0.00"},null,"FG","Fishing / Camera Gear Pack"]
[0,"Camera  Bag Plus",{"v":21.6,"d":"22"},"Camera case / 2 Aux Batteries / Charger",null,2,{"v":0,"d":"0.00"},{"v":0,"d":"0.00"},{"v":0,"d":"0.00"},null,{"v":0,"d":"0.00"},null,"FG","Fishing / Camera Gear Pack"]
[0,"Camera - 2 batteries and charger",{"v":5.5,"d":"6"},"Camera - 2 Aux Batteries & Charger",null,2,{"v":0,"d":"0.00"},{"v":0,"d":"0.00"},{"v":0,"d":"0.00"},null,{"v":0,"d":"0.00"},null,"FG","Fishing / Camera Gear Pack"]
[0,"Tripod",52,"Geekoto Tripod",null,2,{"v":0,"d":"0.00"},{"v":0,"d":"0.00"},{"v":0,"d":"0.00"},null,{"v":0,"d":"0.00"},null,"FG","Fishing / Camera Gear Pack"]
[1,"Tripod",{"v":10.9,"d":"11"},"Ulanzi MT-22 Camera Tripod",null,2,{"$f":"IF(E182=1,A182*C182,0)","v":{"v":0,"d":"0.00"}},{"$f":"G182/16","v":{"v":0,"d":"0.00"}},{"$f":"G182","v":{"v":0,"d":"0.00"}},null,{"$f":"IF(F182>=1,(A182*C182)/16,0)","v":{"v":0.68125,"d":"0.68"}},null,"FG","Fishing / Camera Gear Pack"]
[0,"Car Key",{"v":2.9,"d":"3"},"Keys - (Complete set - Acurra)",1,null,{"v":0,"d":"0.00"},{"v":0,"d":"0.00"},{"v":0,"d":"0.00"},null,{"v":0,"d":"0.00"},null,"KC","Key Chain"]
[2,"carabiners",3,"Carabiners",1,null,{"v":6,"d":"6.00"},{"v":0.375,"d":"0.38"},{"v":6,"d":"6.00"},null,{"v":0,"d":"0.00"},null,"DK","Ditch Kit"]
[0,"Fire starter",{"v":0.5,"d":"1"},"Fire starter* .5 oz Wind & waterproof matches & stove should be enough....",1,null,{"v":0,"d":"0.00"},{"v":0,"d":"0.00"},{"v":0,"d":"0.00"},null,{"v":0,"d":"0.00"},null,"BP","BackPack"]
[1,"Fire Stick",{"v":1.7,"d":"2"},"Magnesium Fire stick",1,null,{"v":1.7,"d":"1.70"},{"v":0.10625,"d":"0.11"},{"v":1.7,"d":"1.70"},null,{"v":0,"d":"0.00"},null,"DK","Ditch Kit"]
[0,"GoPro straps",{"v":1.9,"d":"2"},"GoPro Wrist Strap",1,null,{"v":0,"d":"0.00"},{"v":0,"d":"0.00"},{"v":0,"d":"0.00"},null,{"v":0,"d":"0.00"},null,"RS","Red Stuff Sack"]
[0,"GoPro straps",{"v":1.1,"d":"1"},"GoPro Hat Clip",1,null,{"v":0,"d":"0.00"},{"v":0,"d":"0.00"},{"v":0,"d":"0.00"},null,{"v":0,"d":"0.00"},null,"RS","Red Stuff Sack"]
[0,"GoPro straps",{"v":7.4,"d":"7"},"GoPro Chest Strap",1,null,{"v":0,"d":"0.00"},{"v":0,"d":"0.00"},{"v":0,"d":"0.00"},null,{"v":0,"d":"0.00"},null,"RS","Red Stuff Sack"]
[1,"GoPro straps",{"v":3.4,"d":"3"},"GoPro Head Strap",1,null,{"v":3.4,"d":"3.40"},{"v":0.2125,"d":"0.21"},{"v":3.4,"d":"3.40"},null,{"v":0,"d":"0.00"},null,"FG","Fishing / Camera Gear Pack"]
[0,"GoPro straps",{"v":6.2,"d":"6"},"GoPro Shoulder Strap",1,null,{"v":0,"d":"0.00"},{"v":0,"d":"0.00"},{"v":0,"d":"0.00"},null,{"v":0,"d":"0.00"},null,"RS","Red Stuff Sack"]
[2,"Insect repellent",{"v":2.2,"d":"2"},"Ultrathon with DEET in 1/4 oz. container",1,null,{"v":4.4,"d":"4.40"},{"v":0.275,"d":"0.28"},{"v":4.4,"d":"4.40"},null,{"v":0,"d":"0.00"},null,"DK","Ditch Kit"]
[0,"Marking Tape",{"v":1.1,"d":"1"},"Surveyor Tape",1,null,{"v":0,"d":"0.00"},{"v":0,"d":"0.00"},{"v":0,"d":"0.00"},null,{"v":0,"d":"0.00"},null,"DK","Ditch Kit"]
[4,"Note Pad",{"v":1.3,"d":"1"},"Note pad",1,null,{"v":5.2,"d":"5.20"},{"v":0.325,"d":"0.33"},{"v":5.2,"d":"5.20"},null,{"v":0,"d":"0.00"},null,"DK","Ditch Kit"]
[1,"Pencil",1,"Small pencil ",1,null,{"v":1,"d":"1.00"},{"v":0.0625,"d":"0.06"},{"v":1,"d":"1.00"},null,{"v":0,"d":"0.00"},null,"DK","Ditch Kit"]
[0,"Rubber bands/pins",{"v":0.4,"d":"0"},"Rubber bands, safety pins, tape, needle & thread",1,null,{"v":0,"d":"0.00"},{"v":0,"d":"0.00"},{"v":0,"d":"0.00"},null,{"v":0,"d":"0.00"},null,"DK","Ditch Kit"]
[1,"Scouring pad",1,"Scouring pad .1 oz Cut about 1/3 from the regular size ",1,null,{"v":1,"d":"1.00"},{"v":0.0625,"d":"0.06"},{"v":1,"d":"1.00"},null,{"v":0,"d":"0.00"},null,"FP","Food Pack / Barrel"]
[1,"Smart Phone",{"v":9.5,"d":"10"},"Smart Phone (Samsung S6 w/belt clip)",1,null,{"v":9.5,"d":"9.50"},{"v":0.59375,"d":"0.59"},{"v":9.5,"d":"9.50"},null,{"v":0,"d":"0.00"},null,"RS","Red Stuff Sack"]
[0,"Straps",{"v":0.6,"d":"1"},"Bungee loops to tie items to Canoe",null,2,{"v":0,"d":"0.00"},{"v":0,"d":"0.00"},{"v":0,"d":"0.00"},null,{"v":0,"d":"0.00"},null,"OG","Other Gear"]
[1,"Set of Wire Ties",2,"Gear ties for canoe 8 assorted ties",null,2,{"$f":"IF(E200=1,A200*C200,0)","v":{"v":0,"d":"0.00"}},{"$f":"G200/16","v":{"v":0,"d":"0.00"}},{"$f":"G200","v":{"v":0,"d":"0.00"}},null,{"$f":"IF(F200>=1,(A200*C200)/16,0)","v":{"v":0.125,"d":"0.13"}},null,"C","Canoe"]
[1,"Wallet",{"v":5.7,"d":"6"},"Complete wallet",1,null,{"v":5.7,"d":"5.70"},{"v":0.35625,"d":"0.36"},{"v":5.7,"d":"5.70"},null,{"v":0,"d":"0.00"},null,"BP","BackPack"]
[0,"Wallet",{"v":0.5,"d":"1"},"Wallet  - Pared down (Approx weight)",1,null,{"v":0,"d":"0.00"},{"v":0,"d":"0.00"},{"v":0,"d":"0.00"},null,{"v":0,"d":"0.00"},null,"W","Wallet"]
["Clothing:"]
[null,"Shirt(s)"]
[1,"Long Sleeve Shirt",{"v":7.4,"d":"7"},"Ice Breaker BodyFit 200 Shirt",1,null,{"$f":"IF(E205=1,A205*C205,0)","v":{"v":7.4,"d":"7.40"}},{"$f":"G205/16","v":{"v":0.4625,"d":"0.46"}},{"$f":"G205","v":{"v":7.4,"d":"7.40"}},null,{"$f":"IF(F205>=1,(A205*C205)/16,0)","v":{"v":0,"d":"0.00"}},null,"MC",{"$f":"_xlfn.XLOOKUP($M205,$A$319:$A$336,$B$319:$B$336,\"Not Found\")","v":"Medium Compression sack"}]
[0,"Long Sleeve Shirt",{"v":7.4,"d":"7"},"Ice Breaker BodyFit 200 Shirt",null,1,{"v":0,"d":"0.00"},{"v":0,"d":"0.00"},{"v":0,"d":"0.00"},null,{"v":0,"d":"0.00"},null,"OP","On Person"]
[0,"Long sleeve shirt",{"v":9.5,"d":"10"},"HeatKeep BaseLayer top Shirt",1,null,{"v":0,"d":"0.00"},{"v":0,"d":"0.00"},{"v":0,"d":"0.00"},null,{"v":0,"d":"0.00"},null,"PJ","Sleeping Bag Stuff Sack"]
[4,"Long sleeve shirt",{"v":8.7,"d":"9"},"Columbia Bahama Shirt",1,null,{"v":34.8,"d":"34.80"},{"v":2.175,"d":"2.18"},{"v":34.8,"d":"34.80"},null,{"v":0,"d":"0.00"},null,"MC","Medium Compression sack"]
[0,"Long sleeve shirt",{"v":7.8,"d":"8"},"Sanoma - Cotton shirt",1,null,{"v":0,"d":"0.00"},{"v":0,"d":"0.00"},{"v":0,"d":"0.00"},null,{"v":0,"d":"0.00"},null,"MC","Medium Compression sack"]
[0,"Long sleeve shirt",{"v":14.6,"d":"15"},"Vantage - Cotton Button down shirt",1,null,{"v":0,"d":"0.00"},{"v":0,"d":"0.00"},{"v":0,"d":"0.00"},null,{"v":0,"d":"0.00"},null,"MC","Medium Compression sack"]
[0,"Long sleeve shirt",{"v":10.8,"d":"11"},"Urban Pipeline Shirt",1,null,{"v":0,"d":"0.00"},{"v":0,"d":"0.00"},{"v":0,"d":"0.00"},null,{"v":0,"d":"0.00"},null,"MC","Medium Compression sack"]
[0,"Long sleeve shirt",{"v":6.1,"d":"6"},"Duofold Shirt",1,null,{"v":0,"d":"0.00"},{"v":0,"d":"0.00"},{"v":0,"d":"0.00"},null,{"v":0,"d":"0.00"},null,"MC","Medium Compression sack"]
[2,"Long sleeve shirt",{"v":6.2,"d":"6"},"Huk",1,null,{"$f":"IF(E213=1,A213*C213,0)","v":{"v":12.4,"d":"12.40"}},{"$f":"G213/16","v":{"v":0.775,"d":"0.78"}},{"$f":"G213","v":{"v":12.4,"d":"12.40"}},null,{"$f":"IF(F213>=1,(A213*C213)/16,0)","v":{"v":0,"d":"0.00"}},null,"MC","Medium Compression sack"]
[1,"Long sleeve shirt",{"v":9.3,"d":"9"},"Hooded Bamboo shirt",1,null,{"v":9.3,"d":"9.30"},{"v":0.58125,"d":"0.58"},{"v":9.3,"d":"9.30"},null,{"v":0,"d":"0.00"},null,"MC","Medium Compression sack"]
[1,"Short sleeve shirt",{"v":5.7,"d":"6"},"Cotton Short sleeve shirt - Algonquin Tee",1,null,{"v":5.7,"d":"5.70"},{"v":0.35625,"d":"0.36"},{"v":5.7,"d":"5.70"},null,{"v":0,"d":"0.00"},null,"SC","Small Compression Sack"]
[null,"Socks"]
[2,"Cotton Socks",{"v":1.8,"d":"2"},"Daily Socks",1,null,{"$f":"IF(E217=1,A217*C217,0)","v":{"v":3.6,"d":"3.60"}},{"$f":"G217/16","v":{"v":0.225,"d":"0.23"}},{"$f":"G217","v":{"v":3.6,"d":"3.60"}},null,{"$f":"IF(F217>=1,(A217*C217)/16,0)","v":{"v":0,"d":"0.00"}},null,"MC",{"$f":"_xlfn.XLOOKUP($M217,$A$319:$A$336,$B$319:$B$336,\"Not Found\")","v":"Medium Compression sack"}]
[1,"Cotton Socks",{"v":1.8,"d":"2"},"Daily Socks - Worn",null,1,{"v":0,"d":"0.00"},{"v":0,"d":"0.00"},{"v":0,"d":"0.00"},null,{"v":0.1125,"d":"0.11"},null,"OP","On Person"]
[1,"Dry Socks",{"v":7.2,"d":"7"},"Neoprene Dry Socks",1,null,{"v":7.2,"d":"7.20"},0.45,{"v":7.2,"d":"7.20"},null,{"v":0,"d":"0.00"},null,"FG","Fishing / Camera Gear Pack"]
[1,"Dry Socks",{"v":7.2,"d":"7"},"Neoprene Dry Socks - Worn",null,1,{"v":0,"d":"0.00"},{"v":0,"d":"0.00"},{"v":0,"d":"0.00"},null,0.45,null,"FG","Fishing / Camera Gear Pack"]
[0,"lightweight Cotton Socks",{"v":1.2,"d":"1"},"Hiking Socks",1,null,{"v":0,"d":"0.00"},{"v":0,"d":"0.00"},{"v":0,"d":"0.00"},null,{"v":0,"d":"0.00"},null,"MC","Medium Compression sack"]
[0,"Wool Socks",{"v":3.8,"d":"4"},"Wool/Warm socks - daily use",1,null,{"v":0,"d":"0.00"},{"v":0,"d":"0.00"},{"v":0,"d":"0.00"},null,{"v":0,"d":"0.00"},null,"MC","Medium Compression sack"]
[1,"Wool Socks",{"v":3.8,"d":"4"},"Wool/Warm socks for sleeping",1,null,{"v":3.8,"d":"3.80"},{"v":0.2375,"d":"0.24"},{"v":3.8,"d":"3.80"},null,{"v":0,"d":"0.00"},null,"PJ","Sleeping Bag Stuff Sack"]
[null,"Pants"]
[0,"Blue Jeans",{"v":26.3,"d":"26"},"Blue Jeans",1,null,{"$f":"IF(E225=1,A225*C225,0)","v":{"v":0,"d":"0.00"}},{"$f":"G225/16","v":{"v":0,"d":"0.00"}},{"$f":"G225","v":{"v":0,"d":"0.00"}},null,{"$f":"IF(F225>=1,(A225*C225)/16,0)","v":{"v":0,"d":"0.00"}},null,"MC",{"$f":"_xlfn.XLOOKUP($M225,$A$319:$A$336,$B$319:$B$336,\"Not Found\")","v":"Medium Compression sack"}]
[1,"Fishing/Wading pants",{"v":10.9,"d":"11"},"No label Quick Dry Pant - 32 waist",1,null,{"v":10.9,"d":"10.90"},{"v":0.68125,"d":"0.68"},{"v":10.9,"d":"10.90"},null,{"v":0,"d":"0.00"},null,"MC","Medium Compression sack"]
[1,"Fishing/Wading pants",13,"RailRiders, Adventure Khakis pants",1,null,{"v":13,"d":"13.00"},{"v":0.8125,"d":"0.81"},{"v":13,"d":"13.00"},null,{"v":0,"d":"0.00"},null,"OP","On Person"]
[1,"Fishing/Wading pants",{"v":12.6,"d":"13"},"Free Soldier dry pant",null,2,{"$f":"IF(E228=1,A228*C228,0)","v":{"v":0,"d":"0.00"}},{"$f":"G228/16","v":{"v":0,"d":"0.00"}},{"$f":"G228","v":{"v":0,"d":"0.00"}},null,{"$f":"IF(F228>=1,(A228*C228)/16,0)","v":{"v":0.7875,"d":"0.79"}},null,"TB","Travel Bag"]
[0,"Fishing/Wading pants",{"v":10.4,"d":"10"},"NOUKOW Men's Outdoor Hiking Pants Quick Dry Lightweight Waterproof Work Pants",null,1,{"v":0,"d":"0.00"},{"v":0,"d":"0.00"},{"v":0,"d":"0.00"},null,{"v":0,"d":"0.00"},null,"OP","On Person"]
[1,"Fishing/Wading pants",{"v":12.7,"d":"13"},"Columbia dry Pants",null,2,{"$f":"IF(E230=1,A230*C230,0)","v":{"v":0,"d":"0.00"}},{"$f":"G230/16","v":{"v":0,"d":"0.00"}},{"$f":"G230","v":{"v":0,"d":"0.00"}},null,{"$f":"IF(F230>=1,(A230*C230)/16,0)","v":{"v":0.79375,"d":"0.79"}},null,"TB","Travel Bag"]
[0,"Fishing/Wading pants",{"v":16.5,"d":"17"},"Sanoma Dry pant",null,1,{"v":0,"d":"0.00"},{"v":0,"d":"0.00"},{"v":0,"d":"0.00"},null,{"v":0,"d":"0.00"},null,"OP","On Person"]
[2,"Web Belt",4,"Web Belt",null,1,{"$f":"IF(E232=1,A232*C232,0)","v":{"v":0,"d":"0.00"}},{"$f":"G232/16","v":{"v":0,"d":"0.00"}},{"$f":"G232","v":{"v":0,"d":"0.00"}},null,{"$f":"IF(F232>=1,(A232*C232)/16,0)","v":{"v":0.5,"d":"0.50"}},null,"OP","On Person"]
[0,"Insulated Gortex Pants",{"v":1.8,"d":"2"},"Wild Country Gear",null,1,{"v":0,"d":"0.00"},{"v":0,"d":"0.00"},{"v":0,"d":"0.00"},null,{"v":0,"d":"0.00"},null,"MC","Medium Compression sack"]
[0,"Long Johns",{"v":7.3,"d":"7"},"ArctiCore BaseLayer Pants",1,null,{"v":0,"d":"0.00"},{"v":0,"d":"0.00"},{"v":0,"d":"0.00"},null,{"v":0,"d":"0.00"},null,"PJ","Sleeping Bag Stuff Sack"]
[3,"Underwear",{"v":2.2,"d":"2"},"Underwear ",1,null,{"v":6.6000000000000005,"d":"6.60"},{"v":0.41250000000000003,"d":"0.41"},{"v":6.6000000000000005,"d":"6.60"},null,{"v":0,"d":"0.00"},null,"MC","Medium Compression sack"]
[1,"Underwear",{"v":2.2,"d":"2"},"Underwear - Worn",null,1,{"v":0,"d":"0.00"},{"v":0,"d":"0.00"},{"v":0,"d":"0.00"},null,{"v":0.1375,"d":"0.14"},null,"OP","On Person"]
[null,"Sweat Suit"]
[0,"Sweat Pants",{"v":17.1,"d":"17"},"Sweat Pants - St Johns Bay",1,null,{"$f":"IF(E238=1,A238*C238,0)","v":{"v":0,"d":"0.00"}},{"$f":"G238/16","v":{"v":0,"d":"0.00"}},{"$f":"G238","v":{"v":0,"d":"0.00"}},null,{"$f":"IF(F238>=1,(A238*C238)/16,0)","v":{"v":0,"d":"0.00"}},null,"SC",{"$f":"_xlfn.XLOOKUP($M238,$A$319:$A$336,$B$319:$B$336,\"Not Found\")","v":"Small Compression Sack"}]
[0,"Sweat Pants",{"v":14.3,"d":"14"},"Sweat Pants - Froot of the Loom",1,null,{"v":0,"d":"0.00"},{"v":0,"d":"0.00"},{"v":0,"d":"0.00"},null,{"v":0,"d":"0.00"},null,"SC",{"$f":"_xlfn.XLOOKUP($M239,$A$319:$A$336,$B$319:$B$336,\"Not Found\")","v":"Small Compression Sack"}]
[0,"Sweat Shirt",{"v":18.4,"d":"18"},"Hooded Sweat shirt - outer Banks",1,null,{"v":0,"d":"0.00"},{"v":0,"d":"0.00"},{"v":0,"d":"0.00"},null,{"v":0,"d":"0.00"},null,"SC",{"$f":"_xlfn.XLOOKUP($M240,$A$319:$A$336,$B$319:$B$336,\"Not Found\")","v":"Small Compression Sack"}]
[1,"Sweat Shirt",{"v":17.9,"d":"18"},"Hooded Sweat shirt - Algonquin",null,null,{"v":0,"d":"0.00"},{"v":0,"d":"0.00"},{"v":0,"d":"0.00"},null,{"v":0,"d":"0.00"},null,"TB",{"$f":"_xlfn.XLOOKUP($M241,$A$319:$A$336,$B$319:$B$336,\"Not Found\")","v":"Travel Bag"}]
[null,"Foot Wear",{"v":17.1,"d":"17"}]
[1,"Water Shoes",{"v":14.2,"d":"14"},"Water Shoes",null,1,{"$f":"IF(E243=1,A243*C243,0)","v":{"v":0,"d":"0.00"}},{"$f":"G243/16","v":{"v":0,"d":"0.00"}},{"$f":"G243","v":{"v":0,"d":"0.00"}},null,{"$f":"IF(F243>=1,(A243*C243)/16,0)","v":{"v":0.8875,"d":"0.89"}},null,"OP",{"$f":"_xlfn.XLOOKUP($M243,$A$319:$A$336,$B$319:$B$336,\"Not Found\")","v":"On Person"}]
[0,"Hiking Shoe",{"v":26.9,"d":"27"},"Ortho Feet Hiking shoe",1,null,{"v":0,"d":"0.00"},{"v":0,"d":"0.00"},{"v":0,"d":"0.00"},null,{"v":0,"d":"0.00"},null,"BP","BackPack"]
[0,"Hiking Shoe",{"v":14.3,"d":"14"},"Merrell Hiking shoe",null,1,{"v":0,"d":"0.00"},{"v":0,"d":"0.00"},{"v":0,"d":"0.00"},null,{"v":0,"d":"0.00"},null,"OP","On Person"]
[0,"Shoe laces",{"v":0.8,"d":"1"},"Extra Shoe Laces",1,null,{"v":0,"d":"0.00"},{"v":0,"d":"0.00"},{"v":0,"d":"0.00"},null,{"v":0,"d":"0.00"},null,"DK","Ditch Kit"]
[1,"Shoes",{"v":17.3,"d":"17"},"Ortho feet Sneaker",1,null,{"v":17.3,"d":"17.30"},{"v":1.08125,"d":"1.08"},{"v":17.3,"d":"17.30"},null,{"v":0,"d":"0.00"},null,"BP","BackPack"]
[0,"Kayak Boots",32,"NRS Titaniuim Kayak Boots",null,1,{"$f":"IF(E248=1,A248*C248,0)","v":{"v":0,"d":"0.00"}},{"$f":"G248/16","v":{"v":0,"d":"0.00"}},{"$f":"G248","v":{"v":0,"d":"0.00"}},null,{"$f":"IF(F248>=1,(A248*C248)/16,0)","v":{"v":0,"d":"0.00"}},null,"OP","On Person"]
[0,"Wading Shoes",32,"Wading shoes",null,2,{"v":0,"d":"0.00"},{"v":0,"d":"0.00"},{"v":0,"d":"0.00"},null,{"v":0,"d":"0.00"},null,"FG","Fishing / Camera Gear Pack"]
[0,"Wading Sandels",{"v":19.2,"d":"19"},"Ecco Water Sandels",null,1,{"$f":"IF(E250=1,A250*C250,0)","v":{"v":0,"d":"0.00"}},{"$f":"G250/16","v":{"v":0,"d":"0.00"}},{"$f":"G250","v":{"v":0,"d":"0.00"}},null,{"$f":"IF(F250>=1,(A250*C250)/16,0)","v":{"v":0,"d":"0.00"}},null,"OP","On Person"]
[null,"Head gear"]
[0,"Hat",{"v":3.3,"d":"3"},"Skull Cap",null,1,{"$f":"IF(E252=1,A252*C252,0)","v":{"v":0,"d":"0.00"}},{"$f":"G252/16","v":{"v":0,"d":"0.00"}},{"$f":"G252","v":{"v":0,"d":"0.00"}},null,{"$f":"IF(F252>=1,(A252*C252)/16,0)","v":{"v":0,"d":"0.00"}},null,"OG",{"$f":"_xlfn.XLOOKUP($M252,$A$319:$A$336,$B$319:$B$336,\"Not Found\")","v":"Other Gear"}]
[0,"Hat",{"v":2.6,"d":"3"},"Field Cap (Ball)",null,1,{"v":0,"d":"0.00"},{"v":0,"d":"0.00"},{"v":0,"d":"0.00"},null,{"v":0,"d":"0.00"},null,"FG","Fishing / Camera Gear Pack"]
[0,"Hat",5,"Hoodie - Dickie style - Misty Mountain",1,null,{"v":0,"d":"0.00"},{"v":0,"d":"0.00"},{"v":0,"d":"0.00"},null,{"v":0,"d":"0.00"},null,"BP","BackPack"]
[1,"Hat",{"v":3.8,"d":"4"},"Red Head brand wide brim Hat",null,1,{"v":0,"d":"0.00"},{"v":0,"d":"0.00"},{"v":0,"d":"0.00"},null,{"v":0.2375,"d":"0.24"},null,"OP","On Person"]
[0,"Hat",{"v":2.9,"d":"3"},"Northface wide brim Hat",null,1,{"v":0,"d":"0.00"},{"v":0,"d":"0.00"},{"v":0,"d":"0.00"},null,{"v":0,"d":"0.00"},null,"OP","On Person"]
[1,"Mosquito Head Net",{"v":0.6,"d":"1"},"Mosquito Head Net ",1,null,{"v":0.6,"d":"0.60"},{"v":0.0375,"d":"0.04"},{"v":0.6,"d":"0.60"},null,{"v":0,"d":"0.00"},null,"DK","Ditch Kit"]
[0,"Mosquito Shirt",{"v":3.8,"d":"4"},"Mosquito Shirt ",1,null,{"$f":"IF(E258=1,A258*C258,0)","v":{"v":0,"d":"0.00"}},{"$f":"G258/16","v":{"v":0,"d":"0.00"}},{"$f":"G258","v":{"v":0,"d":"0.00"}},null,{"$f":"IF(F258>=1,(A258*C258)/16,0)","v":{"v":0,"d":"0.00"}},null,"DK","Ditch Kit"]
[2,"Toque",{"v":1.2,"d":"1"},"Toque",1,null,{"v":2.4,"d":"2.40"},0.15,{"v":2.4,"d":"2.40"},null,{"v":0,"d":"0.00"},null,"DK","Ditch Kit"]
[null,"Jacket / Coat"]
[0,"Fleece",{"v":15.3,"d":"15"},"Fleece - Bass Pro Shops - Dads/green",null,1,{"$f":"IF(E261=1,A261*C261,0)","v":{"v":0,"d":"0.00"}},{"$f":"G261/16","v":{"v":0,"d":"0.00"}},{"$f":"G261","v":{"v":0,"d":"0.00"}},null,{"$f":"IF(F261>=1,(A261*C261)/16,0)","v":{"v":0,"d":"0.00"}},null,"OP",{"$f":"_xlfn.XLOOKUP($M261,$A$319:$A$336,$B$319:$B$336,\"Not Found\")","v":"On Person"}]
[0,"Jacket",{"v":15.7,"d":"16"},"Jacket - Northface - Grey",null,1,{"v":0,"d":"0.00"},{"v":0,"d":"0.00"},{"v":0,"d":"0.00"},null,{"v":0,"d":"0.00"},null,"OP",{"$f":"_xlfn.XLOOKUP($M262,$A$319:$A$336,$B$319:$B$336,\"Not Found\")","v":"On Person"}]
[0,"Jacket",{"v":12.8,"d":"13"},"Jacket - Nike Therma-fit",null,1,{"v":0,"d":"0.00"},{"v":0,"d":"0.00"},{"v":0,"d":"0.00"},null,{"v":0,"d":"0.00"},null,"OP",{"$f":"_xlfn.XLOOKUP($M263,$A$319:$A$336,$B$319:$B$336,\"Not Found\")","v":"On Person"}]
[0,"Jacket",{"v":35.8,"d":"36"},"Jacket - Reddington ",null,1,{"v":0,"d":"0.00"},{"v":0,"d":"0.00"},{"v":0,"d":"0.00"},null,{"v":0,"d":"0.00"},null,"OP",{"$f":"_xlfn.XLOOKUP($M264,$A$319:$A$336,$B$319:$B$336,\"Not Found\")","v":"On Person"}]
[0,null,0,{"$nulls":3},{"v":0,"d":"0.00"},{"v":0,"d":"0.00"},{"v":0,"d":"0.00"},null,{"v":0,"d":"0.00"}]
["Food (total for trip):"]
[null,"Personal"]
[0,"Gorp - Extra",16,"Trail Mix 1lb packages (zip lock bags)",null,1,{"$f":"IF(E268=1,A268*C268,0)","v":{"v":0,"d":"0.00"}},{"$f":"G268/16","v":{"v":0,"d":"0.00"}},{"$f":"G268","v":{"v":0,"d":"0.00"}},null,{"$f":"IF(F268>=1,(A268*C268)/16,0)","v":{"v":0,"d":"0.00"}},null,"OP",{"$f":"_xlfn.XLOOKUP($M268,$A$319:$A$336,$B$319:$B$336,\"Not Found\")","v":"On Person"}]
[0,"Gorp - For trail",16,"Trail Mix 1lb packages (zip lock bags)",null,3,{"v":0,"d":"0.00"},{"v":0,"d":"0.00"},{"v":0,"d":"0.00"},null,{"v":0,"d":"0.00"},null,"FP",{"$f":"_xlfn.XLOOKUP($M269,$A$319:$A$336,$B$319:$B$336,\"Not Found\")","v":"Food Pack / Barrel"}]
[null,"Group"]
[0,"Breakfasts ",{"v":4.1,"d":"4"},"4.1 oz.  Mountain House granola, blueberries & milk",null,3,{"$f":"IF(E271=1,A271*C271,0)","v":{"v":0,"d":"0.00"}},{"$f":"G271/16","v":{"v":0,"d":"0.00"}},{"$f":"G271","v":{"v":0,"d":"0.00"}},null,{"$f":"IF(F271>=1,(A271*C271)/16,0)","v":{"v":0,"d":"0.00"}},null,"FP",{"$f":"_xlfn.XLOOKUP($M271,$A$319:$A$336,$B$319:$B$336,\"Not Found\")","v":"Food Pack / Barrel"}]
[0,"Dinners",{"v":3.5,"d":"4"},"3.5 oz.  Mountain House entrees. ",null,3,{"v":0,"d":"0.00"},{"v":0,"d":"0.00"},{"v":0,"d":"0.00"},null,{"v":0,"d":"0.00"},null,"FP","Food Pack / Barrel"]
[0,"Lunches ",{"v":2.35,"d":"2"},"2.35 oz Lipton dry soup mix",null,3,{"v":0,"d":"0.00"},{"v":0,"d":"0.00"},{"v":0,"d":"0.00"},null,{"v":0,"d":"0.00"},null,"FP","Food Pack / Barrel"]
[0,"Maple Syrup",32,"Maple Syrup",null,3,{"v":0,"d":"0.00"},{"v":0,"d":"0.00"},{"v":0,"d":"0.00"},null,{"v":0,"d":"0.00"},null,"FP","Food Pack / Barrel"]
[0,"Olive Oil",8,"Small squirt bottle of Olive Oil",null,3,{"v":0,"d":"0.00"},{"v":0,"d":"0.00"},{"v":0,"d":"0.00"},null,{"v":0,"d":"0.00"},null,"FP","Food Pack / Barrel"]
[0,"Soy Sauce",8,"Small squirt bottle of Soy Sauce",null,3,{"v":0,"d":"0.00"},{"v":0,"d":"0.00"},{"v":0,"d":"0.00"},null,{"v":0,"d":"0.00"},null,"FP","Food Pack / Barrel"]
["Fishing Gear:"]
[0,"Fish Net",{"v":6.4,"d":"6"},"Small Fish net",null,2,{"$f":"IF(E278=1,A278*C278,0)","v":{"v":0,"d":"0.00"}},{"$f":"G278/16","v":{"v":0,"d":"0.00"}},{"$f":"G278","v":{"v":0,"d":"0.00"}},null,{"$f":"IF(F278>=1,(A278*C278)/16,0)","v":{"v":0,"d":"0.00"}},null,"FG",{"$f":"_xlfn.XLOOKUP($M278,$A$319:$A$336,$B$319:$B$336,\"Not Found\")","v":"Fishing / Camera Gear Pack"}]
[0,"Fish Net",{"v":10.3,"d":"10"},"Large Fish Net",null,2,{"$f":"IF(E279=1,A279*C279,0)","v":{"v":0,"d":"0.00"}},{"$f":"G279/16","v":{"v":0,"d":"0.00"}},{"$f":"G279","v":{"v":0,"d":"0.00"}},null,{"$f":"IF(F279>=1,(A279*C279)/16,0)","v":{"v":0,"d":"0.00"}},null,"FG","Fishing / Camera Gear Pack"]
[0,"Reel - Fly 5 Wgt - Floating",{"v":8.3,"d":"8"},"Fly Reel - 5 Wgt - Floating - with Case",null,2,{"v":0,"d":"0.00"},{"v":0,"d":"0.00"},{"v":0,"d":"0.00"},null,{"v":0,"d":"0.00"},null,"FG","Fishing / Camera Gear Pack"]
[0,"Reel - Fly 8 Wgt - Floating",{"v":8.9,"d":"9"},"Fly Reel - 8 Wgt - Floating - With Case",null,2,{"v":0,"d":"0.00"},{"v":0,"d":"0.00"},{"v":0,"d":"0.00"},null,{"v":0,"d":"0.00"},null,"FG","Fishing / Camera Gear Pack"]
[0,"Reel - Fly 8 Wgt - Sinking",{"v":9.3,"d":"9"},"Fly Reel - 8 Wgt - Sinking",null,2,{"v":0,"d":"0.00"},{"v":0,"d":"0.00"},{"v":0,"d":"0.00"},null,{"v":0,"d":"0.00"},null,"FG","Fishing / Camera Gear Pack"]
[0,"Reel - Spinning",6,"Spinning Reel - Ultra Light ",null,2,{"v":0,"d":"0.00"},{"v":0,"d":"0.00"},{"v":0,"d":"0.00"},null,{"v":0,"d":"0.00"},null,"FG","Fishing / Camera Gear Pack"]
[0,"Reel - Spinning",{"v":8.4,"d":"8"},"Spinning Reel - Stampede",null,2,{"v":0,"d":"0.00"},{"v":0,"d":"0.00"},{"v":0,"d":"0.00"},null,{"v":0,"d":"0.00"},null,"FG","Fishing / Camera Gear Pack"]
[0,"Reel - Spinning",{"v":10.4,"d":"10"},"Spinning Reel - cardinal",null,2,{"v":0,"d":"0.00"},{"v":0,"d":"0.00"},{"v":0,"d":"0.00"},null,{"v":0,"d":"0.00"},null,"FG","Fishing / Camera Gear Pack"]
[0,"Reel - Spinning",{"v":13.9,"d":"14"},"Spinning Reel - Daiwa",null,2,{"v":0,"d":"0.00"},{"v":0,"d":"0.00"},{"v":0,"d":"0.00"},null,{"v":0,"d":"0.00"},null,"FG","Fishing / Camera Gear Pack"]
[0,"Rod - Fly 5 Wgt",{"v":20.5,"d":"21"},"Fly Rod - 5 Wgt with case",null,2,{"v":0,"d":"0.00"},{"v":0,"d":"0.00"},{"v":0,"d":"0.00"},null,{"v":0,"d":"0.00"},null,"FG","Fishing / Camera Gear Pack"]
[0,"Rod - Fly 8 Wgt",4,"Fly Rod - 8 Wgt",null,2,{"$f":"IF(E288=1,A288*C288,0)","v":{"v":0,"d":"0.00"}},{"v":0,"d":"0.00"},{"v":0,"d":"0.00"},null,{"v":0,"d":"0.00"},null,"FG","Fishing / Camera Gear Pack"]
[0,"Rod - Spinning",{"v":4.1,"d":"4"},"Spinning Rod - Garcia",null,2,{"v":0,"d":"0.00"},{"v":0,"d":"0.00"},{"v":0,"d":"0.00"},null,{"v":0,"d":"0.00"},null,"FG","Fishing / Camera Gear Pack"]
[0,"Rod - Spinning",{"v":3.4,"d":"3"},"Spinning Rod - Apollo",null,2,{"v":0,"d":"0.00"},{"v":0,"d":"0.00"},{"v":0,"d":"0.00"},null,{"v":0,"d":"0.00"},null,"FG","Fishing / Camera Gear Pack"]
[0,"Rod - Spinning",{"v":3.2,"d":"3"},"Spinning Rod - Ultra Light - Berkley",null,2,{"v":0,"d":"0.00"},{"v":0,"d":"0.00"},{"v":0,"d":"0.00"},null,{"v":0,"d":"0.00"},null,"FG","Fishing / Camera Gear Pack"]
[0,"Rod - Spinning",{"v":4.4,"d":"4"},"Spinning Rod - Stampede",null,2,{"v":0,"d":"0.00"},{"v":0,"d":"0.00"},{"v":0,"d":"0.00"},null,{"v":0,"d":"0.00"},null,"FG","Fishing / Camera Gear Pack"]
[0,"Spoons/Flies/Lures …",{"v":19.2,"d":"19"},"Spoons/Flies/Lures … In PFD",null,1,{"v":0,"d":"0.00"},{"v":0,"d":"0.00"},{"v":0,"d":"0.00"},null,{"v":0,"d":"0.00"},null,"FG","Fishing / Camera Gear Pack"]
[0,"Waders - Insulated",47,"Waders - Insulated",null,2,{"v":0,"d":"0.00"},{"v":0,"d":"0.00"},{"v":0,"d":"0.00"},null,{"v":0,"d":"0.00"},null,"FG","Fishing / Camera Gear Pack"]
[0,"Waders - not insulated",26,"Waders - not insulated",null,2,{"v":0,"d":"0.00"},{"v":0,"d":"0.00"},{"v":0,"d":"0.00"},null,{"v":0,"d":"0.00"},null,"FG","Fishing / Camera Gear Pack"]
["Extra Gear:"]
[1,"IBM Surface",{"v":38.4,"d":"38"},"IBM Surface",null,4,{"$f":"IF(E297=1,A297*C297,0)","v":{"v":0,"d":"0.00"}},{"$f":"G297/16","v":{"v":0,"d":"0.00"}},{"$f":"G297","v":{"v":0,"d":"0.00"}},null,{"$f":"IF(F297>=1,(A297*C297)/16,0)","v":{"v":2.4,"d":"2.40"}},null,"TB",{"$f":"_xlfn.XLOOKUP($M297,$A$319:$A$336,$B$319:$B$336,\"Not Found\")","v":"Travel Bag"}]
[0,"PassPort",2,"Passport",null,4,{"v":0,"d":"0.00"},{"v":0,"d":"0.00"},{"v":0,"d":"0.00"},null,{"v":0,"d":"0.00"},null,"TB","Travel Bag"]
[3,"Travel Cloths",2,"Travel Cloths",null,4,{"v":0,"d":"0.00"},{"v":0,"d":"0.00"},{"v":0,"d":"0.00"},null,{"v":0.375,"d":"0.38"},null,"TB","Travel Bag"]
[1,"Travel Toiletries",2,"Travel Toiletries",null,4,{"v":0,"d":"0.00"},{"v":0,"d":"0.00"},{"v":0,"d":"0.00"},null,{"v":0.125,"d":"0.13"},null,"TB","Travel Bag"]
[1,"Travel Towel",2,"Travel Towel",null,4,{"v":0,"d":"0.00"},{"v":0,"d":"0.00"},{"v":0,"d":"0.00"},null,{"v":0.125,"d":"0.13"},null,"TB","Travel Bag"]
["*","Leave this line as is - used to determine end of processing"]
[]
[]
[null,"TOTAL WEIGHT (in Oz.):",{"$f":"SUM(C4:C302)","v":{"v":2962.2440000000024,"d":"2,962.24"}},{"$nulls":3},{"$f":"SUM(G4:G302)","v":{"v":1164.724,"d":"1,164.72"}},null,{"$f":"SUM(I4:I302)","v":{"v":1164.724,"d":"1,164.72"}}]
[null,"TOTAL WEIGHT (in Lbs.):",{"$f":"C305/16","v":{"v":185.14025000000015,"d":"185.14"}},{"$nulls":3},{"$f":"G305/16","v":{"v":72.79525,"d":"72.80"}},null,{"$f":"I305/16","v":{"v":72.79525,"d":"72.80"}}]
[]
[null,"Weights highlighted in Yellow are estimates"]
[]
[]
[]
[null,"CONVERSION LBS to OZ"]
[{"$nulls":3},"Total weight in Oz.",null,null,{"$f":"(C314*16)+C315","v":87}]
[null,"Enter LBS",5]
[null,"Enter additional Oz",7]
[]
[]
["Value","Description","Code"]
["C","Canoe","ag"]
["BP","BackPack","a"]
["BS","Blue Stuff Sack","o"]
["DK","Ditch Kit","g"]
["FG","Fishing / Camera Gear Pack","u"]
["FP","Food Pack / Barrel","s"]
["KC","Key Chain","aa"]
["MC","Medium Compression sack","m"]
["OG","Other Gear","ac"]
["OP","On Person","ae"]
["OS","Orange Stuff Sack","q"]
["PJ","Sleeping Bag Stuff Sack","u"]
["RS","Red Stuff Sack","e"]
["SC","Small Compression Sack","k"]
["TB","Travel Bag","w"]
["W","Wallet","y"]
["XC","XXS Compression Sack","ac"]
[null,"Unlisted / Mis-coded","ai"]

{"sheet":"Packing list","index":1,"n_rows":33,"n_cols":37,"rows_kept":33}
["BackPack",null,"Sleeping bag dry bag",null,"Red Stuff Sack",null,"Ditch Kit",null,"Medium Compression bag",null,"Small Compression Sack",null,"XX Small Compression Sack",null,"Blue Stuff sack",null,"Orange Stuff sack",null,"Bear Bag - Food Pack/Barrel",null,"Fishing gear",null,"Trip Bag (Small suit case/day pack)",null,"Wallet",null,"Key Chain",null,"Other Gear",null,"On Person",null,"Canoe",null,"Incorrectly coded",null,"Total Back Pack weight"]
[{"$f":"(A3/16)","v":{"v":23.065625000000004,"d":"23.07 Lbs"}},null,{"$f":"(C3/16)","v":{"v":3.5125,"d":"3.51 Lbs"}},null,{"$f":"(E3/16)","v":{"v":2.725,"d":"2.73 Lbs"}},null,{"$f":"(G3/16)","v":{"v":4.24375,"d":"4.24 Lbs"}},null,{"$f":"(I3/16)","v":{"v":3.7375000000000003,"d":"3.74 Lbs"}},null,{"$f":"(K3/16)","v":{"v":3.4937500000000004,"d":"3.49 Lbs"}},null,{"$f":"(M3/16)","v":{"v":0.1125,"d":"0.11 Lbs"}},null,{"$f":"(O3/16)","v":{"v":0.2125,"d":"0.21 Lbs"}},null,{"$f":"(Q3/16)","v":{"v":0.40625,"d":"0.41 Lbs"}},null,{"$f":"(S3/16)","v":{"v":3.7875,"d":"3.79 Lbs"}},null,{"$f":"(U3/16)","v":{"v":9.40625,"d":"9.41 Lbs"}},null,{"$f":"(W3/16)","v":{"v":4.26875,"d":"4.27 Lbs"}},null,{"$f":"(Y3/16)","v":{"v":0.03125,"d":"0.03 Lbs"}},null,{"$f":"(AA3/16)","v":{"v":0,"d":"0.00 Lbs"}},null,{"$f":"(AC3/16)","v":{"v":0,"d":"0.00 Lbs"}},null,{"$f":"(AE3/16)","v":{"v":5.90625,"d":"5.91 Lbs"}},null,{"$f":"(AG3/16)","v":{"v":0.2375,"d":"0.24 Lbs"}},null,{"$f":"(AI3/16)","v":{"v":0,"d":"0.00 Lbs"}},null,{"$f":"(AK3/16)","v":{"v":41.540625,"d":"41.54 Lbs"}}]
[{"v":369.05000000000007,"d":"369.05 Oz."},null,{"v":56.2,"d":"56.20 Oz."},null,{"v":43.6,"d":"43.60 Oz."},null,{"v":67.9,"d":"67.90 Oz."},null,{"v":59.800000000000004,"d":"59.80 Oz."},null,{"v":55.900000000000006,"d":"55.90 Oz."},null,1.8,null,3.4,null,{"v":6.5,"d":"6.50 Oz."},null,{"v":60.6,"d":"60.60 Oz."},null,{"v":150.5,"d":"150.50 Oz."},null,{"v":68.3,"d":"68.30 Oz."},null,{"v":0.5,"d":"0.50 Oz."},{"$nulls":5},{"v":94.5,"d":"94.50 Oz."},null,{"v":3.8,"d":"3.80 Oz."},{"$nulls":3},{"$f":"SUM(A3:Q3, Y3, AA3, AC3)","v":{"v":664.65,"d":"664.65 Oz."}}]
["(1) 55 L  Earth Pack",null,"(1) Wool Mummy bag - 3.5 lbs",null,"(2) Limefuel Battery pack to recharge phone, Cannon and GoPro",null,"(1) SOL Bivvy",null,"(1) Med Sea to Summit Dry Compression Sac",null,"(1) Small Sea to Summit Dry Compression Sac",null,"(1) 2X Small Sea to Summit Dry Compression Sac",null,"(1) Blue Dry Bag",null,"(1) Orange Dry Bag",null,"(1) 32 L  Earth Pack",null,"(1) Fishing Fillet knife",null,"(1) Hooded Sweat shirt - Algonquin",null,"(1) Wallet  - Pared down (Approx weight)",{"$nulls":5},"(1) Chinook PFD",null,"(1) SLR Rain Sleeve"]
["(1) The FitLife walking sticks (Carbon - Pair - No baskets)",null,"(1) LuxPro Headlamp - Rechargeable (with cabel)",null,"(1) GoPro Hero 3 camera w/large rechargeable battery",null,"(1) Blue Whistle",null,"(1) Ice Breaker BodyFit 200 Shirt",null,"(1) Hennessey SiNylon tarp - Hex Fly + Snake Skins - Hammock cover",{"$nulls":7},"(1) Camp Oven - Old BSA Mess Kit ",null,"(1) Cannon EOS T6",null,"(1) IBM Surface",{"$nulls":7},"(1) Multi Tool (Leatherman w/holster)",null,"(1) Gear ties for canoe 8 assorted ties"]
["(1) Hennessey Ultra-Light Hammock, with stuff sack but NO Tarp",{"$nulls":3},"(2) GoPro reg batteries",null,"(1) TwinGage Clip-on Compas",null,"(2) Columbia Bahama Shirt",null,"(1) Hennessey SiNylon tarp - Hex Fly + Snake Skins - Camp Tarp",{"$nulls":7},"(1) Copper grill Mat (ea.) (I have 5)",null,"(1) Cannon 18-55 mm lense",null,"(1) Passport",{"$nulls":7},"(1) Swiss Army Knife"]
["(1) Hammock Hanging Hardware (2 bieners & 4 rap rings)",{"$nulls":3},"(1) GoPro back for reg batteries",null,"(1) Starter brand Compas",null,"(2) Daily Socks",null,"(1) Cotton Short sleeve shirt - Algonquin Tee",{"$nulls":7},"(1) Scouring pad .1 oz Cut about 1/3 from the regular size ",null,"(1) Cannon 75-300 mm Lense",null,"(3) Travel Cloths",{"$nulls":7},"(1) Comb"]
["(1) Rallt Tree hammock hanging straps long - set of 2 straps",{"$nulls":3},"(1) Smart Phone (Samsung S6 w/belt clip)",null,"(1) Emergency Blanket for ditch kit and Use with Under-quilt/Air mattres",null,"(2) No label Quick Dry Pant - 32 waist",{"$nulls":11},"(1) Cannon 50 mm Lense",null,"(1) Travel Toiletries",{"$nulls":7},"(1) Dwalt Shock resistant Sunglasses"]
["(10) Tent Stake(s)",{"$nulls":5},"(1) Quetico Waterproof map",null,"(2) Underwear ",{"$nulls":11},"(1) Camera pack ",null,"(1) Travel Towel",{"$nulls":7},"(1) Daily Socks - Worn"]
["(1) UnderCover for Hammock ",{"$nulls":5},"(1) Spot Personl Location device (with Batteries)",{"$nulls":13},"(1) Camera - 2 Aux Batteries & Charger",{"$nulls":9},"(1) RailRiders, Adventure Khakis pants"]
["(1) Rain Gear (Pants)",{"$nulls":5},"(7) One daily dose (both AM & PM) meds",{"$nulls":13},"(1) GoPro Head Strap",{"$nulls":9},"(1) Web Belt"]
["(1) Rain Gear (Top) Red Ledge jacket",{"$nulls":5},"(2) TP",{"$nulls":13},"(1) Large Fish Net",{"$nulls":9},"(1) Underwear - Worn"]
["(1) MSR WhisperLite Stove",{"$nulls":5},"(1) Part of larger Duct Tape roll",{"$nulls":13},"(1) Fly Reel - 8 Wgt - Sinking",{"$nulls":9},"(1) Ecco Water Sandels"]
["(1) Emberlit-UL Backpacking stove",{"$nulls":5},"(1) Coghlans - First Aid kit",{"$nulls":13},"(1) Spinning Reel - Stampede",{"$nulls":9},"(1) Red Head brand wide brim Hat"]
["(1) Titanium Wind Screen",{"$nulls":5},"(3) box of small wooden matches",{"$nulls":13},"(1) Fly Rod - 8 Wgt",{"$nulls":9},"(1) Jacket - Nike Therma-fit"]
["(2) 20  Fl. Oz. MSR Fuel Bottles - Full",{"$nulls":5},"(1) Three sheets of MoleSkin",{"$nulls":13},"(1) Spinning Rod - Stampede"]
["(4) Chop Sticks",{"$nulls":5},"(1) 12 Asprin & 6 Aleve",{"$nulls":13},"(1) Spoons/Flies/Lures … In PFD"]
["(1) GSI Personal Java Press",{"$nulls":5},"(1) Waxed Thead - spool"]
["(1) Small Camp Axe",{"$nulls":5},"(1) Waxed Twine"]
["(1) Pocket Boy Silky saw",{"$nulls":5},"(1) 25 feet extra Para Cord"]
["(1) 22 Oz. LifeStraw Go bottle full (7.3 oz empty)",{"$nulls":5},"(1) AquaSeal Patch Kit"]
["(1) Platypus Gravity Works 4.0L empty",{"$nulls":5},"(1) Colapsable bucket"]
["(1) Campsuds",{"$nulls":5},"(2) Carabiners"]
["(1) Dental Floss",{"$nulls":5},"(1) Magnesium Fire stick"]
["(1) Metal Mirror - Use it for grooming & as an emergency signal device",{"$nulls":5},"(1) Mosquito Head Net "]
["(1) Tooth Brush / in case",{"$nulls":5},"(1) Mosquito Shirt "]
["(1) Tube of Toothpaste",{"$nulls":5},"(1) Toque"]
["(2) Chamis towel"]
["(1) 2X Reading Glasses from CVS"]
["(3) Mag lite/Garmin Batteries (AA Lithium)"]
["(1) Charging Cabel - USB/USB C"]
["(1) Geekoto Tripod"]
["(1) Ortho feet Sneaker"]

{"sheet":"Final Check","index":2,"n_rows":22,"n_cols":1,"rows_kept":22}
["Trip bag - packed"]
["BackPack - Packed"]
["Fishing Gear"]
["Cooler"]
["Trip Snacks"]
["PFD(s)"]
["Trip Water bottles"]
["Spot (if not in Pack)"]
["GoPro (if not in Pack)"]
[]
[]
["On-Person"]
["Passport"]
["Knife"]
["Stripped down wallet"]
["Stripped key chain"]
["Phone"]
["Comb"]
["Sunglasses"]
["Reading glasses"]
["Jacket"]
["Ipad (if not in Trip Bag)"]